program: Orca
programVersion: 5.0.2
elementType: Si F O O C C C C C C C C C C C C C C C C C C C C C C C C C H H H H H H H H H H H H H H H H H H H H H H H H H H H H H
charge: 0
multiplicity: 1
keywords: wb97x-d3
keywords: def2-TZVPP
keywords: def2/J RIJCOSX
keywords: DEFGRID2
keywords: scfconv7
keywords: smallprint printgap noloewdin
keywords: NOSOSCF
formula: C25H29FO2Si
InChI: InChI=1/C25H29FO2Si/c1-4-27-21-13-15-23(16-14-21)29(2,3)18-8-9-20-12-17-24(26)25(19-20)28-22-10-6-5-7-11-22/h5-7,10-17,19H,4,8-9,18H2,1-3H3
58 atoms
Si -2.352462 1.512153 -0.420732
F  1.76691 -4.897094 0.074471
O  2.02175 4.131202 2.841511
O  1.452601 -2.971046 -1.768937
C  -2.554351 -0.297221 0.073703
C  -3.320255 -1.137301 -0.948746
C  -1.012982 2.291473 0.648236
C  -3.961208 2.468049 -0.206337
C  -1.812763 1.629667 -2.222712
C  -3.340268 -2.632153 -0.626025
C  -0.433083 1.636898 1.732664
C  -0.526609 3.571254 0.352443
C  -1.977316 -3.254091 -0.458394
C  0.582989 2.208176 2.493099
C  0.482248 4.160484 1.090481
C  1.047033 3.480764 2.172362
C  -0.895141 -2.834791 -1.227499
C  -1.767283 -4.258786 0.48269
C  0.367273 -3.373809 -1.039641
C  -0.515887 -4.83384 0.654622
C  0.543345 -4.377143 -0.099584
C  2.657651 3.482291 3.937235
C  3.707511 4.41617 4.485853
C  1.682302 -1.62061 -1.905489
C  1.497092 -0.727446 -0.856222
C  2.156039 -1.18455 -3.13416
C  1.79207 0.614951 -1.051973
C  2.447852 0.160581 -3.313799
C  2.262267 1.066073 -2.27822
H  -1.548609 -0.707352 0.212383
H  -3.039844 -0.367838 1.052928
H  -2.902882 -0.988782 -1.948333
H  -4.355714 -0.793159 -1.015289
H  -3.840099 3.516771 -0.485836
H  -4.757332 2.055729 -0.830375
H  -4.308626 2.44365 0.828396
H  -0.936589 1.008786 -2.423318
H  -2.60614 1.310752 -2.901807
H  -1.554579 2.65629 -2.491546
H  -3.911646 -2.798967 0.290428
H  -3.882882 -3.157714 -1.41819
H  -0.763778 0.641811 2.007594
H  -0.93716 4.129913 -0.482042
H  0.994036 1.648773 3.322589
H  0.841205 5.150952 0.837911
H  -1.020166 -2.056236 -1.971039
H  -2.590636 -4.597844 1.098832
H  -0.358396 -5.613696 1.388468
H  3.114578 2.544528 3.605698
H  1.921943 3.238044 4.710106
H  4.208974 3.939485 5.327547
H  4.464417 4.652809 3.737789
H  3.26841 5.347574 4.843823
H  1.13329 -1.064473 0.106744
H  2.294353 -1.891729 -3.942106
H  1.653269 1.310801 -0.234229
H  2.814281 0.49935 -4.273974
H  2.485106 2.114646 -2.423116
elementType: Si F O C H
totalener: -1510.05289505 hartree
nucrepener: 2906.14214079 hartree
electener: -4416.19503583 hartree
oneelecener: -7842.36423610 hartree
twoeener: 3426.16920026 hartree
cpcmener: -0.02692486 hartree
kineticenergy: 1503.90284497 hartree
xcener: -135.232061887441 hartree
chargesum: -0.0000000
charge: 0.453170 -0.220438 -0.339995 -0.348817 -0.242850 -0.115544 -0.115493 -0.436580 -0.419714 -0.109361 -0.216366 -0.130647 0.032990 -0.201243 -0.271843 0.333243 -0.232239 -0.200104 0.213134 -0.170936 0.183665 0.067778 -0.275998 0.287333 -0.193275 -0.257249 -0.116914 -0.091051 -0.227704 0.067304 0.100986 0.078228 0.091243 0.100233 0.101309 0.101874 0.086427 0.113173 0.110821 0.085735 0.091975 0.144088 0.135228 0.138297 0.136294 0.153388 0.143778 0.150680 0.095768 0.094276 0.090164 0.087325 0.087132 0.160252 0.148390 0.152860 0.160682 0.155139
qa: 0.4532 -0.2204 -0.3400 -0.3488 -0.2429 -0.1155 -0.1155 -0.4366 -0.4197 -0.1094 -0.2164 -0.1306 0.0330 -0.2012 -0.2718 0.3332 -0.2322 -0.2001 0.2131 -0.1709 0.1837 0.0678 -0.2760 0.2873 -0.1933 -0.2572 -0.1169 -0.0911 -0.2277 0.0673 0.1010 0.0782 0.0912 0.1002 0.1013 0.1019 0.0864 0.1132 0.1108 0.0857 0.0920 0.1441 0.1352 0.1383 0.1363 0.1534 0.1438 0.1507 0.0958 0.0943 0.0902 0.0873 0.0871 0.1603 0.1484 0.1529 0.1607 0.1551
va: 4.1142 1.0647 2.0661 2.0621 3.8674 3.8863 3.7219 3.9188 3.8815 3.8714 3.8776 3.8828 3.6365 3.8350 4.0287 3.7480 3.8872 3.9190 3.6567 3.8759 4.0736 3.7890 3.9734 3.6896 3.8574 4.0128 3.7861 3.8520 3.9263 1.0139 1.0147 1.0013 1.0074 1.0103 1.0095 1.0100 1.0159 1.0082 1.0119 1.0059 1.0027 0.9906 0.9936 1.0128 1.0134 0.9967 1.0000 0.9970 0.9868 0.9868 1.0055 1.0034 1.0032 0.9973 1.0065 0.9884 0.9864 0.9949
dispcorr: -0.032468757 hartree
energy: -1510.085363803120
dipole: -14.58048 13.53068 -1.04980 27.13192 -26.74234 0.38958 6.20112 -5.46492 0.73620
magnitude: 1.34009 au
magnitude: 3.40624 debye
