program: Orca
programVersion: 5.0.2
elementType: Si F O O C C C C C C C C C C C C C C C C C C C C C C C C C H H H H H H H H H H H H H H H H H H H H H H H H H H H H H
charge: 0
multiplicity: 1
keywords: wb97x-d3
keywords: def2-TZVPP
keywords: def2/J RIJCOSX
keywords: DEFGRID2
keywords: scfconv7
keywords: smallprint printgap noloewdin
keywords: NOSOSCF
formula: C25H29FO2Si
InChI: InChI=1/C25H29FO2Si/c1-4-27-21-13-15-23(16-14-21)29(2,3)18-8-9-20-12-17-24(26)25(19-20)28-22-10-6-5-7-11-22/h5-7,10-17,19H,4,8-9,18H2,1-3H3
58 atoms
Si -3.090387 0.134732 0.511247
F  3.825766 -0.265702 -0.897555
O  1.367674 3.052435 3.388507
O  2.35131 -2.193211 -2.015395
C  -2.457216 -0.0938 -1.249589
C  -2.17814 1.2226 -1.978027
C  -1.744959 1.069763 1.442126
C  -3.338894 -1.554107 1.304819
C  -4.685434 1.128365 0.540997
C  -1.153455 1.100363 -3.113866
C  -2.009045 2.176855 2.244555
C  -0.403634 0.679957 1.330519
C  0.208595 0.748657 -2.586166
C  -1.004582 2.869718 2.913834
C  0.612743 1.350378 1.98393
C  0.318022 2.455395 2.785646
C  0.657027 -0.567587 -2.599131
C  1.015852 1.722289 -1.999784
C  1.867494 -0.914871 -2.015981
C  2.240244 1.39248 -1.439082
C  2.649464 0.074828 -1.443671
C  1.135179 4.198267 4.199783
C  2.463101 4.664703 4.74051
C  1.505069 -3.221893 -1.676697
C  0.534352 -3.094183 -0.690376
C  1.689902 -4.42606 -2.339623
C  -0.261916 -4.187579 -0.380709
C  0.893211 -5.513746 -2.010933
C  -0.090526 -5.398589 -1.038085
H  -1.542053 -0.692007 -1.166632
H  -3.150265 -0.709302 -1.831962
H  -1.814645 1.985626 -1.280527
H  -3.112465 1.616627 -2.386192
H  -2.417336 -2.141312 1.27156
H  -3.634977 -1.46818 2.352347
H  -4.111313 -2.131628 0.792158
H  -5.459104 0.624985 -0.043243
H  -5.076343 1.252425 1.552912
H  -4.553451 2.124791 0.114887
H  -1.484726 0.342395 -3.827746
H  -1.105153 2.048911 -3.653974
H  -3.027071 2.530424 2.363259
H  -0.132008 -0.168937 0.711689
H  -1.272507 3.722695 3.522408
H  1.641261 1.027403 1.874965
H  0.048221 -1.336449 -3.060664
H  0.687179 2.753913 -1.9783
H  2.868867 2.149387 -0.987907
H  0.455611 3.948673 5.020935
H  0.66384 4.989801 3.607947
H  2.308275 5.547091 5.361241
H  2.93545 3.901279 5.359561
H  3.150358 4.938244 3.93933
H  0.396197 -2.160879 -0.159454
H  2.451185 -4.511591 -3.104466
H  -1.020661 -4.085089 0.384703
H  1.038502 -6.452574 -2.528891
H  -0.715795 -6.246043 -0.791609
elementType: Si F O C H
totalener: -1510.05365518 hartree
nucrepener: 2917.55641844 hartree
electener: -4427.61007362 hartree
oneelecener: -7865.43132261 hartree
twoeener: 3437.82124898 hartree
cpcmener: -0.02883949 hartree
kineticenergy: 1503.91111091 hartree
xcener: -135.231741482403 hartree
chargesum: -0.0000000
charge: 0.443940 -0.221905 -0.339537 -0.346341 -0.206840 -0.152750 -0.269280 -0.407823 -0.449345 -0.080906 -0.068360 0.016506 0.072948 -0.294160 -0.373726 0.401668 -0.237846 -0.229327 0.218924 -0.204524 0.212983 0.065959 -0.275330 0.222919 -0.163454 -0.215604 -0.207795 -0.146360 -0.162172 0.026418 0.095259 0.080931 0.090152 0.089515 0.104789 0.104575 0.110448 0.106186 0.108581 0.083469 0.095480 0.143632 0.115188 0.140017 0.134551 0.154363 0.143237 0.151166 0.094366 0.095271 0.090259 0.087437 0.087102 0.228187 0.148116 0.166268 0.161195 0.161382
qa: 0.4439 -0.2219 -0.3395 -0.3463 -0.2068 -0.1527 -0.2693 -0.4078 -0.4493 -0.0809 -0.0684 0.0165 0.0729 -0.2942 -0.3737 0.4017 -0.2378 -0.2293 0.2189 -0.2045 0.2130 0.0660 -0.2753 0.2229 -0.1635 -0.2156 -0.2078 -0.1464 -0.1622 0.0264 0.0953 0.0809 0.0902 0.0895 0.1048 0.1046 0.1104 0.1062 0.1086 0.0835 0.0955 0.1436 0.1152 0.1400 0.1346 0.1544 0.1432 0.1512 0.0944 0.0953 0.0903 0.0874 0.0871 0.2282 0.1481 0.1663 0.1612 0.1614
va: 4.1473 1.0617 2.0670 2.0695 3.8248 3.9069 3.7776 3.8952 3.9230 3.8469 3.7931 3.6519 3.5726 3.9273 4.0497 3.6982 3.8985 3.8489 3.6575 3.8502 4.0306 3.7925 3.9728 3.7702 3.8362 3.9677 3.9279 3.9032 3.8925 1.0300 1.0180 1.0018 1.0082 1.0120 1.0106 1.0086 1.0086 1.0086 1.0056 1.0095 1.0058 0.9872 0.9552 1.0128 1.0151 1.0006 1.0029 0.9982 0.9861 0.9864 1.0057 1.0031 1.0033 0.9031 1.0066 0.9907 0.9879 0.9904
dispcorr: -0.032384852 hartree
energy: -1510.086040034536
dipole: -26.86531 25.02502 -1.84029 12.78782 -11.81321 0.97461 11.93902 -11.74841 0.19060
magnitude: 2.09114 au
magnitude: 5.31526 debye
