program: Gaussian 09
title: 000063632
version: EM64L-G09RevD.01
frameworkgroup: C1[X(C25H24N4O5)]
method: RPBEPBE
basis: SDD
operation: Freq
keyword: #p
keyword: freq=noraman
keyword: PBEPBE/SDD
title: #p freq=noraman PBEPBE/SDD
converged: YES YES NO NO
title: Mulliken charges:
elementType: O O O O O N N N N C C C C C C C C C C C C C C C C C C C C C C C C C H H H H H H H H H H H H H H H H H H H H H H H H
charge: -0.483188 -0.449037 -0.231677 -0.207081 -0.205780 -0.314679 -0.349883 -0.048861 0.026998 0.118272 -0.393590 0.398453 -0.454287 -0.502578 0.112661 -0.380819 -0.371839 0.109507 0.469545 0.159979 0.062462 -0.356972 -0.382475 0.376685 -0.357818 -0.358480 -0.322680 -0.359900 0.450297 -0.341634 -0.404752 -0.244031 -0.205399 -0.806457 0.220975 0.215565 0.289792 0.203777 0.320078 0.223482 0.254347 0.295455 0.244119 0.366642 0.287315 0.287680 0.360429 0.262653 0.251596 0.271715 0.260292 0.233233 0.234622 0.234061 0.233388 0.237399 0.226616 0.233807
chargesum: 0.00000
title: Mulliken charges with hydrogens summed into heavy atoms:
elementType: O O O O O N N N N C C C C C C C C C C C C C C C C C C C C C C C C C
charge: -0.116545 -0.088608 -0.231677 -0.207081 -0.205780 0.005399 -0.349883 -0.048861 0.026998 0.118272 0.042950 0.398453 0.039282 -0.024750 0.112661 -0.085364 -0.127719 0.109507 0.469545 0.159979 0.062462 -0.069657 -0.094795 0.376685 -0.095165 -0.106884 -0.050965 -0.099608 0.450297 -0.108401 -0.170130 -0.009970 0.027989 -0.108634
polarizability: 4.15667233e+02 5.43165048e+01 3.74701483e+02 -3.47059981e+01 1.52189586e+01 2.07177164e+02
1716.lowfreq: -8.9066 -2.6591 -0.0010 -0.0007 0.0005 2.4084 5.7090 8.3410 16.7578
frequency: 4.4015 7.5255 15.5694 21.4109 25.9452 32.0097 34.9011 48.9423 51.7786 65.6835 71.7268 77.4317 102.6495 109.7071 128.9217 150.6860 160.4671 172.3710 179.4891 215.2382 225.3951 242.1044 255.6781 265.7945 275.3760 284.3204 317.5549 324.3571 334.3012 341.5398 356.5026 357.9208 376.5049 410.4486 411.1939 411.8514 441.4623 456.6412 464.3269 484.6256 494.4063 503.4538 512.5823 513.7028 535.9837 557.1115 592.9298 604.4434 620.4596 624.7061 632.9196 636.6560 649.5270 663.4720 675.4394 688.6323 715.8150 716.4556 721.8040 749.7935 766.9985 783.1661 785.4735 791.8011 797.9271 815.3798 843.5166 847.2844 850.0557 859.2748 863.2411 881.3294 896.6159 898.0880 947.3116 952.6900 958.1485 975.1313 979.7853 985.5254 987.7573 996.8440 1002.5038 1003.2078 1010.5001 1014.6927 1017.1721 1020.5611 1046.5623 1048.7427 1056.6353 1067.3508 1092.7013 1100.7776 1104.4917 1117.9741 1119.9041 1140.6248 1140.9700 1164.2269 1177.1827 1186.0130 1201.6567 1213.8405 1219.7136 1220.7346 1234.5663 1238.0687 1244.6445 1273.0990 1288.9402 1289.1458 1302.7107 1314.3865 1323.0709 1325.7138 1336.3519 1352.9681 1361.1950 1368.6774 1378.7249 1392.6432 1398.0161 1398.4408 1404.5808 1407.9473 1439.5553 1451.8391 1457.5770 1464.3070 1469.3843 1469.5074 1473.4836 1475.4083 1477.5293 1502.2148 1554.4040 1564.4489 1588.7056 1593.1125 1604.9056 1612.7672 1619.6808 1624.2836 2885.7885 2906.4729 2979.7240 3010.6371 3015.9844 3059.6259 3072.6331 3089.0446 3119.6788 3129.7388 3132.0864 3134.8294 3135.3346 3149.3027 3152.9417 3162.9563 3163.9113 3165.9785 3173.5118 3180.8679 3185.1022 3416.2757 3441.7044 3556.9576
redmass: 4.6255 6.6739 1.0832 7.5707 6.0314 5.6419 5.7395 4.1902 4.5324 6.1415 5.5139 4.5691 5.0855 6.6241 6.3580 5.2036 5.4155 4.3327 3.3303 3.7876 4.0320 5.3099 5.1647 5.7695 4.5571 6.3316 3.6375 3.0885 3.4803 2.5830 1.6871 4.7648 3.0170 3.1613 2.9125 3.4593 4.3030 4.7013 5.8638 5.4585 3.8974 5.1873 3.7312 5.9150 4.8907 5.1825 3.5362 3.4478 2.4035 6.3196 1.8147 6.4481 5.8423 5.3469 4.5361 4.4416 4.2160 5.3212 4.0881 4.2848 1.4395 2.8654 1.7234 8.3502 3.7714 1.7475 3.2019 1.2682 1.5402 3.7690 2.8420 1.4475 2.2117 1.5224 2.5685 1.3604 3.6539 1.3768 1.3750 1.3585 1.5384 3.7065 3.1919 1.3322 1.8001 1.9136 2.0195 2.1784 2.9850 1.6432 3.0369 2.6697 3.2953 1.8536 1.4729 1.7001 1.3200 1.5976 3.7742 1.1416 1.2735 1.1263 1.6115 2.0321 6.0365 2.7423 3.0522 3.0382 2.5776 1.5324 1.7570 1.2760 1.2885 1.2645 1.3033 3.5418 1.2547 1.4456 6.7698 5.4654 1.4559 8.6745 10.9461 1.2600 3.0527 4.1191 1.2173 2.6666 2.6731 1.1059 1.0839 1.0741 1.9041 1.0996 1.1674 2.7630 9.0792 7.1880 6.5835 7.9860 6.4375 8.2913 6.8833 8.2620 1.0699 1.0697 1.0378 1.0842 1.0693 1.0968 1.0890 1.0991 1.1007 1.0882 1.0891 1.0861 1.0900 1.0900 1.0968 1.0968 1.0954 1.0886 1.1000 1.0945 1.0964 1.0643 1.0738 1.0663
irintensity: 0.3860 0.3067 0.4831 0.6224 0.0896 0.3256 1.3449 1.6508 2.9970 1.6243 1.8908 3.7776 2.9472 0.9648 0.9106 5.7390 1.8040 0.5000 1.3552 6.3510 0.9079 0.2153 2.2223 3.0651 4.2949 2.5636 1.8490 9.0154 3.6252 46.3706 48.7368 6.6958 8.6864 0.0232 0.8235 0.5396 9.3897 7.0412 5.6350 1.7774 3.1661 4.2402 16.6684 0.6880 2.3691 6.2220 33.9188 2.8523 61.7939 1.2779 101.9236 3.2323 2.2676 13.1731 28.7279 24.5369 6.4326 18.2404 6.9043 7.6873 68.1901 39.7937 43.3177 29.7342 1.2503 33.6886 8.8930 0.5787 17.5307 5.9227 8.8234 29.3875 3.4683 0.9311 69.3198 3.0188 67.5705 0.5282 2.6290 3.8054 0.8817 5.0126 4.7051 0.0227 3.3791 2.3001 19.7104 13.4603 9.5608 19.2756 51.1573 34.9217 21.1041 18.4412 12.2510 54.8739 4.1841 16.2622 113.9308 1.0191 31.8500 3.8708 23.7415 1.2922 401.3418 9.7614 15.3897 23.3728 15.6850 16.0878 4.4083 0.5621 0.7657 16.3914 22.1655 119.9813 3.9242 45.5730 70.6921 5.5009 14.7769 27.5850 20.9146 13.0152 1.8267 59.1895 82.1697 21.0499 58.2140 6.6029 14.8530 7.5555 3.2563 12.7744 19.2607 89.5935 223.5384 9.1508 5.7143 1.7116 50.2862 219.8225 37.7371 91.1984 71.7394 79.9363 31.0476 5.9533 39.9792 19.1116 12.1057 17.6198 5.4250 10.2569 18.5535 4.5458 11.0351 7.7811 10.8838 2.0484 11.6781 1.7951 27.1591 1.7047 0.4598 58.3097 18.4317 7.9414
temp: 298.150 k
press: 1.00000 atm
elementType: 8 8 8 8 8 7 7 7 7 6 6 6 6 6 6 6 6 6 6 6 6 6 6 6 6 6 6 6 6 6 6 6 6 6 1 1 1 1 1 1 1 1 1 1 1 1 1 1 1 1 1 1 1 1 1 1 1 1
symmnumber: 1
zpe: 1175781.0 jmol-1
zpe.correction: 0.447831 hartree
zpe.thermalcorrener: 0.478755 hartree
zpe.thermalcorrenthalpy: 0.479699 hartree
zpe.thermalcorrgfe: 0.378288 hartree
zpe.sumelectzpe: -1559.682567 hartree
zpe.sumelectthermal: -1559.651644 hartree
zpe.sumelectthermalent: -1559.650699 hartree
zpe.sumelectthermalfe: -1559.752111 hartree
dipole: -2.0017 0.1750 0.0361
dipole: 2.0096
quadrupole: -262.7106 -175.9674 -195.2726
quadrupole: 16.8448 17.1779 -4.5906
quadrupole: -51.3937 35.3494 16.0443 16.8448 17.1779 -4.5906
hfenergy: -1560.1303986 hartree
pointgroup: C01 [X(C25H24N4O5)]
dipole: -0.7860528 -0.0743808 -0.0414392 debye
polarizability: 415.7617904|-59.3033392|364.83453|29.7735384|38.9854288|216.9495596 unknown
InChI: InChI=1S/C25H24N4O5/c1-17-6-10-19(11-7-17)28-23(27-22-5-3-2-4-21(22)24(28)31)14-26-15-25(32,16-30)18-8-12-20(13-9-18)29(33)34/h2-13,26,30,32H,14-16H2,1H3
charge 0 multiplicity 1
58 atoms
O  2.010025 -0.959769 -1.233056
O  2.368256 1.106752 -2.930452
O  -5.089219 -0.979964 -0.950021
O  8.242347 1.993502 1.452852
O  8.612671 -0.17291 0.842121
N  -0.058675 0.170996 0.308212
N  -3.152786 -0.366005 0.243028
N  -2.889646 1.815107 1.235383
N  7.846264 0.856486 0.984756
C  2.246361 0.340684 -0.58236
C  1.352794 0.348178 0.686248
C  3.725775 0.483722 -0.181049
C  1.814885 1.437166 -1.600546
C  -1.014605 0.271229 1.434351
C  -2.421249 0.607538 0.959224
C  4.610816 -0.616395 -0.308745
C  4.218259 1.706501 0.352066
C  -4.468643 -0.098894 -0.291282
C  -2.612869 -1.701985 0.014416
C  -4.98049 1.24834 0.020976
C  -4.17817 2.155864 0.783069
C  5.963333 -0.504388 0.069674
C  5.565583 1.838145 0.736844
C  6.422882 0.726011 0.58566
C  -2.097544 -2.042789 -1.255895
C  -2.639316 -2.658643 1.050408
C  -6.270937 1.63647 -0.425221
C  -4.690666 3.446641 1.089708
C  -1.58188 -4.311786 -0.441485
C  -1.585945 -3.337558 -1.475048
C  -2.120724 -3.952027 0.819826
C  -6.764386 2.914476 -0.115797
C  -5.969745 3.819299 0.644787
C  -1.010998 -5.69687 -0.686631
H  1.742075 -0.446043 1.368472
H  1.469221 1.315628 1.212556
H  0.721704 1.399322 -1.712701
H  2.119655 2.450182 -1.278858
H  -0.171084 -0.693647 -0.239289
H  -1.027906 -0.638992 2.077686
H  -0.719922 1.12391 2.067423
H  4.213093 -1.556274 -0.701515
H  3.548887 2.5654 0.475804
H  2.146226 -0.798015 -2.210615
H  6.659919 -1.342011 -0.022101
H  5.961927 2.770775 1.146788
H  3.322579 1.371517 -2.969816
H  -2.116913 -1.304758 -2.063905
H  -3.076188 -2.398774 2.020839
H  -6.856269 0.915856 -1.005686
H  -4.061279 4.125362 1.67307
H  -1.185838 -3.597205 -2.462158
H  -2.143393 -4.692486 1.627797
H  -7.759693 3.217143 -0.457698
H  -6.360073 4.814769 0.883681
H  0.089934 -5.659486 -0.793523
H  -1.243062 -6.385042 0.143823
H  -1.412859 -6.138455 -1.616695
