program: Orca
programVersion: 5.0.2
elementType: Si F O O C C C C C C C C C C C C C C C C C C C C C C C C C H H H H H H H H H H H H H H H H H H H H H H H H H H H H H
charge: 0
multiplicity: 1
keywords: wb97x-d3
keywords: def2-TZVPP
keywords: def2/J RIJCOSX
keywords: DEFGRID2
keywords: scfconv7
keywords: smallprint printgap noloewdin
keywords: NOSOSCF
formula: C25H29FO2Si
InChI: InChI=1/C25H29FO2Si/c1-4-27-21-13-15-23(16-14-21)29(2,3)18-8-9-20-12-17-24(26)25(19-20)28-22-10-6-5-7-11-22/h5-7,10-17,19H,4,8-9,18H2,1-3H3
58 atoms
Si -2.9660 1.231507 0.782754
F  1.045739 -3.35843 -3.530044
O  2.195943 4.391726 0.833994
O  1.804683 -2.964501 -1.010454
C  -2.376382 -0.559312 0.72108
C  -3.45056 -1.614897 0.479612
C  -1.406647 2.28766 0.772637
C  -3.970301 1.566557 2.334521
C  -3.991513 1.604707 -0.750087
C  -2.904392 -3.05058 0.448276
C  -0.974946 3.020931 1.882558
C  -0.579712 2.306453 -0.351378
C  -1.852011 -3.224151 -0.608414
C  0.220547 3.719344 1.878469
C  0.623664 3.0011 -0.38257
C  1.035579 3.707096 0.745965
C  -0.50667 -3.078005 -0.284591
C  -2.199523 -3.442266 -1.939586
C  0.470972 -3.100343 -1.267917
C  -1.227691 -3.503071 -2.927799
C  0.095079 -3.31907 -2.584521
C  3.145347 4.277104 -0.221258
C  4.397165 5.006644 0.196389
C  2.240101 -2.054847 -0.077439
C  3.402787 -2.384445 0.60541
C  1.600802 -0.842934 0.154137
C  3.926893 -1.49427 1.531489
C  2.125656 0.026655 1.100642
C  3.287256 -0.289865 1.791343
H  -1.624623 -0.606738 -0.074647
H  -1.83291 -0.777691 1.648356
H  -3.963851 -1.413317 -0.465783
H  -4.217136 -1.561041 1.258304
H  -4.305535 2.60402 2.389679
H  -4.863828 0.938117 2.354887
H  -3.405805 1.352033 3.244273
H  -3.43932 1.384085 -1.666418
H  -4.905736 1.007396 -0.771621
H  -4.287843 2.654754 -0.790549
H  -2.486622 -3.295916 1.427995
H  -3.73075 -3.743226 0.27193
H  -1.576198 3.047656 2.784286
H  -0.863487 1.757618 -1.243584
H  0.536163 4.271378 2.755635
H  1.224525 2.970173 -1.281494
H  -0.222348 -2.922328 0.749344
H  -3.240268 -3.56466 -2.21265
H  -1.494317 -3.677545 -3.962259
H  2.740985 4.705561 -1.143688
H  3.366663 3.222177 -0.415216
H  4.829781 4.575749 1.099757
H  5.140307 4.928583 -0.597251
H  4.208488 6.06607 0.37215
H  3.895152 -3.328504 0.410034
H  0.70276 -0.567301 -0.384104
H  4.835832 -1.752923 2.058644
H  1.619793 0.964679 1.290059
H  3.691008 0.396808 2.523097
elementType: Si F O C H
totalener: -1510.05372115 hartree
nucrepener: 2899.91282809 hartree
electener: -4409.96654924 hartree
oneelecener: -7829.74090277 hartree
twoeener: 3419.77435353 hartree
cpcmener: -0.02644229 hartree
kineticenergy: 1503.91084232 hartree
xcener: -135.232272867443 hartree
chargesum: -0.0000000
charge: 0.509097 -0.221049 -0.340148 -0.342123 -0.218694 -0.158349 -0.148081 -0.451489 -0.434979 -0.090437 -0.102460 -0.195762 0.056017 -0.264380 -0.262890 0.331015 -0.264266 -0.222749 0.252830 -0.164268 0.170486 0.071115 -0.274916 0.323782 -0.272657 -0.241078 -0.097878 -0.082933 -0.244991 0.059439 0.089779 0.082877 0.082813 0.109770 0.107569 0.103685 0.106952 0.105529 0.109815 0.085888 0.093049 0.141906 0.141620 0.135552 0.138499 0.151067 0.146188 0.150472 0.094913 0.090014 0.086867 0.090409 0.088069 0.146952 0.181656 0.160629 0.143506 0.156754
qa: 0.5091 -0.2210 -0.3401 -0.3421 -0.2187 -0.1583 -0.1481 -0.4515 -0.4350 -0.0904 -0.1025 -0.1958 0.0560 -0.2644 -0.2629 0.3310 -0.2643 -0.2227 0.2528 -0.1643 0.1705 0.0711 -0.2749 0.3238 -0.2727 -0.2411 -0.0979 -0.0829 -0.2450 0.0594 0.0898 0.0829 0.0828 0.1098 0.1076 0.1037 0.1070 0.1055 0.1098 0.0859 0.0930 0.1419 0.1416 0.1356 0.1385 0.1511 0.1462 0.1505 0.0949 0.0900 0.0869 0.0904 0.0881 0.1470 0.1817 0.1606 0.1435 0.1568
va: 4.1023 1.0630 2.0604 2.0768 3.8085 3.9221 3.7306 3.9273 3.8834 3.8476 3.8598 3.8873 3.6007 4.0154 3.8409 3.7178 3.9171 3.9110 3.6322 3.8734 4.0729 3.7904 3.9736 3.7189 4.0104 3.8886 3.8574 3.7748 3.9870 1.0277 1.0139 1.0013 1.0109 1.0077 1.0097 1.0085 1.0071 1.0059 1.0087 1.0105 1.0076 0.9885 0.9949 1.0139 1.0136 1.0009 1.0007 0.9972 0.9871 0.9868 1.0037 1.0056 1.0031 1.0080 0.9797 0.9871 1.0080 0.9935
dispcorr: -0.031612903 hartree
energy: -1510.085334054479
dipole: -13.58940 12.87819 -0.71121 21.72918 -21.43953 0.28966 13.95259 -13.58182 0.37078
magnitude: 0.85276 au
magnitude: 2.16754 debye
