program: Orca
programVersion: 5.0.2
elementType: Si F O O C C C C C C C C C C C C C C C C C C C C C C C C C H H H H H H H H H H H H H H H H H H H H H H H H H H H H H
charge: 0
multiplicity: 1
keywords: wb97x-d3
keywords: def2-TZVPP
keywords: def2/J RIJCOSX
keywords: DEFGRID2
keywords: scfconv7
keywords: smallprint printgap noloewdin
keywords: NOSOSCF
formula: C25H29FO2Si
InChI: InChI=1/C25H29FO2Si/c1-4-27-21-13-15-23(16-14-21)29(2,3)18-8-9-20-12-17-24(26)25(19-20)28-22-10-6-5-7-11-22/h5-7,10-17,19H,4,8-9,18H2,1-3H3
58 atoms
Si -3.505828 1.251092 0.884497
F  1.221729 -4.516097 0.327289
O  2.425804 2.445819 0.670352
O  1.652638 -1.887049 0.534345
C  -3.855248 -0.592361 0.617812
C  -3.985039 -1.053713 -0.834402
C  -1.667616 1.637551 0.772716
C  -4.085641 1.708182 2.616807
C  -4.426927 2.269617 -0.401044
C  -2.690382 -0.994627 -1.649074
C  -0.772017 1.164328 1.739375
C  -1.125234 2.392428 -0.265016
C  -1.628454 -1.928607 -1.13718
C  0.583122 1.435615 1.67902
C  0.232327 2.682795 -0.346622
C  1.097336 2.21235 0.637543
C  -0.450666 -1.44543 -0.578248
C  -1.820037 -3.308838 -1.197586
C  0.513648 -2.3167 -0.089345
C  -0.868642 -4.188136 -0.707026
C  0.292108 -3.681575 -0.158574
C  3.007316 3.37651 -0.23759
C  2.713908 4.815448 0.129059
C  2.588385 -1.14617 -0.136526
C  2.526892 -0.850762 -1.491907
C  3.655139 -0.699471 0.635722
C  3.541277 -0.091283 -2.063949
C  4.662258 0.046834 0.046965
C  4.610231 0.360706 -1.30573
H  -3.100756 -1.187588 1.14427
H  -4.797849 -0.805404 1.13428
H  -4.738308 -0.448796 -1.346146
H  -4.364758 -2.080013 -0.860535
H  -5.156513 1.532162 2.73824
H  -3.572001 1.120458 3.380814
H  -3.897857 2.761322 2.834587
H  -5.497803 2.057512 -0.368226
H  -4.303562 3.340546 -0.228519
H  -4.087066 2.060625 -1.417432
H  -2.923577 -1.254697 -2.685093
H  -2.301485 0.026391 -1.671192
H  -1.132811 0.563659 2.56769
H  -1.767473 2.782255 -1.046728
H  1.252192 1.059754 2.444111
H  0.587576 3.282687 -1.173753
H  -0.277097 -0.377539 -0.521643
H  -2.727638 -3.70834 -1.632972
H  -1.020349 -5.258671 -0.755806
H  2.706999 3.15627 -1.265661
H  4.078983 3.19042 -0.176029
H  3.056329 5.039374 1.139654
H  3.246975 5.474912 -0.556373
H  1.654173 5.062033 0.063758
H  1.711395 -1.198326 -2.11143
H  3.691748 -0.937709 1.691373
H  3.486888 0.142775 -3.119169
H  5.488676 0.392207 0.65416
H  5.393333 0.951042 -1.761777
elementType: Si F O C H
totalener: -1510.05162556 hartree
nucrepener: 3017.09272737 hartree
electener: -4527.14435293 hartree
oneelecener: -8065.37108117 hartree
twoeener: 3538.22672824 hartree
cpcmener: -0.02834135 hartree
kineticenergy: 1503.91955788 hartree
xcener: -135.239386147674 hartree
chargesum: 0.0000000
charge: 0.493463 -0.219269 -0.347758 -0.337586 -0.270830 -0.158518 -0.149801 -0.460555 -0.446034 -0.096050 -0.112531 -0.143998 -0.036454 -0.319200 -0.209017 0.336745 -0.191022 -0.170321 0.235894 -0.200109 0.215564 0.046676 -0.265751 0.355417 -0.225677 -0.286111 -0.151655 -0.107155 -0.207415 0.082048 0.099015 0.088758 0.093805 0.103253 0.101538 0.101496 0.114220 0.114385 0.102817 0.103329 0.084895 0.134199 0.147381 0.136145 0.142492 0.131791 0.143996 0.149877 0.088672 0.105476 0.088695 0.096199 0.093150 0.159081 0.141248 0.161312 0.159071 0.160712
qa: 0.4935 -0.2193 -0.3478 -0.3376 -0.2708 -0.1585 -0.1498 -0.4606 -0.4460 -0.0961 -0.1125 -0.1440 -0.0365 -0.3192 -0.2090 0.3367 -0.1910 -0.1703 0.2359 -0.2001 0.2156 0.0467 -0.2658 0.3554 -0.2257 -0.2861 -0.1517 -0.1072 -0.2074 0.0820 0.0990 0.0888 0.0938 0.1033 0.1015 0.1015 0.1142 0.1144 0.1028 0.1033 0.0849 0.1342 0.1474 0.1361 0.1425 0.1318 0.1440 0.1499 0.0887 0.1055 0.0887 0.0962 0.0932 0.1591 0.1412 0.1613 0.1591 0.1607
va: 4.0931 1.0679 2.0265 2.0550 3.8346 3.8951 3.6613 3.9045 3.9142 3.8027 3.8290 3.8252 3.7092 3.9817 3.8787 3.6567 3.8709 3.8666 3.5750 3.9032 4.0699 3.8352 3.9552 3.5793 3.8614 3.9488 3.8636 3.8187 3.8541 1.0140 1.0059 1.0010 1.0023 1.0103 1.0109 1.0097 1.0070 1.0091 1.0053 1.0065 1.0134 0.9947 0.9871 1.0135 1.0046 0.9961 1.0005 0.9985 0.9925 0.9888 1.0051 1.0072 1.0022 0.9981 1.0126 0.9893 0.9888 0.9899
dispcorr: -0.035962425 hartree
energy: -1510.087587988141
dipole: -19.13982 18.26443 -0.87538 28.76350 -27.44064 1.32286 -3.23304 1.76562 -1.46743
magnitude: 2.16092 au
magnitude: 5.49263 debye
