program: Orca
programVersion: 5.0.2
elementType: Si F O O C C C C C C C C C C C C C C C C C C C C C C C C C H H H H H H H H H H H H H H H H H H H H H H H H H H H H H
charge: 0
multiplicity: 1
keywords: wb97x-d3
keywords: def2-TZVPP
keywords: def2/J RIJCOSX
keywords: DEFGRID2
keywords: scfconv7
keywords: smallprint printgap noloewdin
keywords: NOSOSCF
formula: C25H29FO2Si
InChI: InChI=1/C25H29FO2Si/c1-4-27-21-13-15-23(16-14-21)29(2,3)18-8-9-20-12-17-24(26)25(19-20)28-22-10-6-5-7-11-22/h5-7,10-17,19H,4,8-9,18H2,1-3H3
58 atoms
Si -2.790954 1.355845 0.490027
F  1.190901 -5.171526 0.638143
O  2.269641 4.680209 0.522734
O  1.760574 -3.112812 -0.985073
C  -2.338036 -0.127156 -0.585995
C  -3.444644 -1.159547 -0.779638
C  -1.255735 2.441987 0.567556
C  -3.253535 0.790025 2.222736
C  -4.215578 2.307904 -0.290966
C  -3.050338 -2.323473 -1.70141
C  -0.685685 2.947203 -0.607317
C  -0.592626 2.731175 1.758269
C  -1.920054 -3.137334 -1.140201
C  0.482122 3.687061 -0.596155
C  0.585333 3.470729 1.795994
C  1.134649 3.950328 0.610192
C  -0.598938 -2.769352 -1.378346
C  -2.166898 -4.231492 -0.314388
C  0.450299 -3.444519 -0.773349
C  -1.124632 -4.933122 0.274233
C  0.173221 -4.523071 0.052162
C  3.092367 4.848877 1.673551
C  3.896076 3.610562 2.007162
C  2.124515 -1.789634 -0.892882
C  3.11012 -1.346066 -1.762478
C  1.571185 -0.932468 0.050548
C  3.544494 -0.029847 -1.686054
C  2.007029 0.38366 0.106642
C  2.990838 0.843088 -0.759442
H  -2.005148 0.244623 -1.56234
H  -1.455849 -0.591659 -0.132912
H  -4.330032 -0.679967 -1.206773
H  -3.755907 -1.564528 0.188293
H  -2.452787 0.209498 2.685127
H  -3.475671 1.631048 2.882356
H  -4.142177 0.155803 2.200959
H  -3.963372 2.652416 -1.296114
H  -5.110498 1.687561 -0.374962
H  -4.482749 3.187137 0.298555
H  -3.920817 -2.964503 -1.857053
H  -2.772083 -1.920773 -2.678675
H  -1.155631 2.755584 -1.566261
H  -0.985865 2.367929 2.70089
H  0.903279 4.059622 -1.522141
H  1.055246 3.651423 2.753236
H  -0.383922 -1.933154 -2.033476
H  -3.186501 -4.542139 -0.123254
H  -1.318034 -5.783397 0.915406
H  2.499449 5.181209 2.530018
H  3.76297 5.668652 1.417398
H  4.54085 3.821929 2.860799
H  3.26896 2.758916 2.271949
H  4.534611 3.32039 1.172305
H  3.533155 -2.024588 -2.492309
H  0.810328 -1.277699 0.739292
H  4.312503 0.314305 -2.366209
H  1.573169 1.051309 0.840332
H  3.322671 1.87206 -0.710457
elementType: Si F O C H
totalener: -1510.05312894 hartree
nucrepener: 2921.09495449 hartree
electener: -4431.14808343 hartree
oneelecener: -7872.38177715 hartree
twoeener: 3441.23369371 hartree
cpcmener: -0.02776287 hartree
kineticenergy: 1503.90969745 hartree
xcener: -135.233579204575 hartree
chargesum: -0.0000000
charge: 0.512541 -0.220769 -0.350656 -0.347603 -0.230149 -0.144154 -0.195483 -0.450552 -0.428779 -0.095563 -0.088662 -0.132178 0.065620 -0.332599 -0.231498 0.351938 -0.253564 -0.222907 0.224064 -0.164625 0.177277 0.050921 -0.276289 0.307399 -0.254462 -0.228468 -0.128462 -0.125991 -0.195914 0.089585 0.058949 0.082398 0.081299 0.107093 0.107696 0.108861 0.104520 0.101887 0.105754 0.090947 0.089049 0.134300 0.142085 0.133617 0.139286 0.156724 0.144807 0.150739 0.088749 0.110002 0.105978 0.089335 0.089137 0.147965 0.162318 0.160031 0.170256 0.156200
qa: 0.5125 -0.2208 -0.3507 -0.3476 -0.2301 -0.1442 -0.1955 -0.4506 -0.4288 -0.0956 -0.0887 -0.1322 0.0656 -0.3326 -0.2315 0.3519 -0.2536 -0.2229 0.2241 -0.1646 0.1773 0.0509 -0.2763 0.3074 -0.2545 -0.2285 -0.1285 -0.1260 -0.1959 0.0896 0.0589 0.0824 0.0813 0.1071 0.1077 0.1089 0.1045 0.1019 0.1058 0.0909 0.0890 0.1343 0.1421 0.1336 0.1393 0.1567 0.1448 0.1507 0.0887 0.1100 0.1060 0.0893 0.0891 0.1480 0.1623 0.1600 0.1703 0.1562
va: 4.1016 1.0643 2.0408 2.0654 3.8231 3.9279 3.7687 3.9246 3.8962 3.8539 3.8177 3.8247 3.6004 4.0290 3.8678 3.6288 3.9063 3.9143 3.6552 3.8687 4.0775 3.8516 3.9090 3.6660 4.0160 3.9432 3.9442 3.7966 3.8780 1.0141 1.0287 1.0085 1.0030 1.0060 1.0083 1.0086 1.0075 1.0079 1.0091 1.0077 1.0094 0.9939 0.9905 1.0162 1.0080 0.9982 1.0013 0.9969 0.9962 0.9919 1.0119 0.9996 1.0026 1.0061 0.9964 0.9888 0.9797 0.9961
dispcorr: -0.033420598 hartree
energy: -1510.086549539296
dipole: -14.75170 13.88241 -0.86928 26.37395 -25.40971 0.96423 5.55176 -5.00839 0.54337
magnitude: 1.40736 au
magnitude: 3.57722 debye
