program: Orca
programVersion: 5.0.2
elementType: Si F O O C C C C C C C C C C C C C C C C C C C C C C C C C H H H H H H H H H H H H H H H H H H H H H H H H H H H H H
charge: 0
multiplicity: 1
keywords: wb97x-d3
keywords: def2-TZVPP
keywords: def2/J RIJCOSX
keywords: DEFGRID2
keywords: scfconv7
keywords: smallprint printgap noloewdin
keywords: NOSOSCF
formula: C25H29FO2Si
InChI: InChI=1/C25H29FO2Si/c1-4-27-21-13-15-23(16-14-21)29(2,3)18-8-9-20-12-17-24(26)25(19-20)28-22-10-6-5-7-11-22/h5-7,10-17,19H,4,8-9,18H2,1-3H3
58 atoms
Si -3.108831 1.346207 0.748049
F  1.794345 -4.385724 0.041977
O  2.027311 2.811179 -2.103252
O  1.98845 -1.714412 -0.258518
C  -3.230609 -0.527875 1.024428
C  -3.763613 -1.363335 -0.140769
C  -1.5140 1.847336 -0.119045
C  -3.134803 2.167399 2.442868
C  -4.562136 1.92602 -0.298049
C  -2.81822 -1.482343 -1.340407
C  -1.444344 2.034712 -1.50462
C  -0.331616 2.025434 0.596486
C  -1.567753 -2.249621 -1.013633
C  -0.260249 2.356192 -2.141948
C  0.872398 2.350235 -0.019033
C  0.914109 2.508434 -1.401948
C  -0.35268 -1.606426 -0.80671
C  -1.617721 -3.636764 -0.872083
C  0.777727 -2.327548 -0.449114
C  -0.492582 -4.367916 -0.527444
C  0.696012 -3.701036 -0.306549
C  3.267907 2.908813 -1.411636
C  4.352928 3.166145 -2.426768
C  2.174325 -0.962972 0.873359
C  3.353038 -0.22781 0.926699
C  1.264805 -0.915443 1.92152
C  3.609218 0.574175 2.027197
C  1.535838 -0.102764 3.01572
C  2.699273 0.649433 3.075029
H  -2.262437 -0.911297 1.366356
H  -3.904778 -0.65819 1.878557
H  -4.709815 -0.942477 -0.491414
H  -4.001508 -2.372818 0.209451
H  -3.028325 3.251284 2.370255
H  -4.072908 1.963046 2.963168
H  -2.32791 1.801084 3.081323
H  -4.548977 3.009955 -0.428231
H  -4.556936 1.479047 -1.294276
H  -5.514825 1.665161 0.16762
H  -3.348775 -1.990853 -2.149156
H  -2.558366 -0.491103 -1.718473
H  -2.334838 1.926219 -2.11362
H  -0.325972 1.910561 1.674651
H  -0.235127 2.492336 -3.216364
H  1.755789 2.475482 0.59279
H  -0.276257 -0.530016 -0.91685
H  -2.552187 -4.158435 -1.03927
H  -0.536775 -5.444474 -0.424612
H  3.468905 1.980351 -0.868068
H  3.22894 3.720015 -0.677392
H  4.188647 4.099679 -2.965455
H  5.311775 3.242153 -1.914566
H  4.425231 2.354166 -3.150592
H  4.059073 -0.279211 0.107402
H  0.346812 -1.488211 1.900424
H  4.52459 1.150348 2.059804
H  0.819881 -0.06121 3.826315
H  2.898226 1.283562 3.928353
elementType: Si F O C H
totalener: -1510.05381597 hartree
nucrepener: 3022.78224539 hartree
electener: -4532.83606136 hartree
oneelecener: -8075.84846258 hartree
twoeener: 3543.01240122 hartree
cpcmener: -0.02655142 hartree
kineticenergy: 1503.90922549 hartree
xcener: -135.235770072006 hartree
chargesum: 0.0000000
charge: 0.473422 -0.219715 -0.341392 -0.341608 -0.262363 -0.151652 -0.142712 -0.463511 -0.436133 -0.106603 -0.100928 -0.158528 -0.027571 -0.282769 -0.307753 0.381714 -0.140480 -0.161970 0.172936 -0.211110 0.252284 0.075858 -0.280862 0.358213 -0.271921 -0.198864 -0.133400 -0.204823 -0.166940 0.070703 0.100004 0.086530 0.093479 0.103768 0.105480 0.101664 0.114235 0.101880 0.112746 0.101737 0.095240 0.146409 0.150981 0.134260 0.146240 0.102462 0.146773 0.149764 0.084018 0.098312 0.090437 0.091367 0.087740 0.148406 0.155038 0.158150 0.162075 0.159282
qa: 0.4734 -0.2197 -0.3414 -0.3416 -0.2624 -0.1517 -0.1427 -0.4635 -0.4361 -0.1066 -0.1009 -0.1585 -0.0276 -0.2828 -0.3078 0.3817 -0.1405 -0.1620 0.1729 -0.2111 0.2523 0.0759 -0.2809 0.3582 -0.2719 -0.1989 -0.1334 -0.2048 -0.1669 0.0707 0.1000 0.0865 0.0935 0.1038 0.1055 0.1017 0.1142 0.1019 0.1127 0.1017 0.0952 0.1464 0.1510 0.1343 0.1462 0.1025 0.1468 0.1498 0.0840 0.0983 0.0904 0.0914 0.0877 0.1484 0.1550 0.1582 0.1621 0.1593
va: 4.1164 1.0675 2.0775 2.0718 3.8240 3.8916 3.6621 3.9146 3.9036 3.8111 3.8190 3.8499 3.6655 4.0418 3.8598 3.7209 3.8508 3.8704 3.6891 3.9191 4.0202 3.7916 3.9785 3.5645 3.9242 3.8116 3.8513 3.8774 3.8677 1.0220 1.0063 1.0014 1.0023 1.0108 1.0106 1.0110 1.0089 1.0061 1.0060 1.0089 1.0097 0.9829 0.9789 1.0141 1.0108 1.0208 0.9984 0.9983 0.9815 0.9873 1.0041 1.0050 1.0035 1.0064 1.0046 0.9890 0.9910 0.9887
dispcorr: -0.036037494 hartree
energy: -1510.089853464942
dipole: -16.49871 15.66376 -0.83495 22.87933 -22.41350 0.46583 2.45214 -1.79990 0.65224
magnitude: 1.15740 au
magnitude: 2.94187 debye
