program: Orca
programVersion: 5.0.2
elementType: Si F O O C C C C C C C C C C C C C C C C C C C C C C C C C H H H H H H H H H H H H H H H H H H H H H H H H H H H H H
charge: 0
multiplicity: 1
keywords: wb97x-d3
keywords: def2-TZVPP
keywords: def2/J RIJCOSX
keywords: DEFGRID2
keywords: scfconv7
keywords: smallprint printgap noloewdin
keywords: NOSOSCF
formula: C25H29FO2Si
InChI: InChI=1/C25H29FO2Si/c1-4-27-21-13-15-23(16-14-21)29(2,3)18-8-9-20-12-17-24(26)25(19-20)28-22-10-6-5-7-11-22/h5-7,10-17,19H,4,8-9,18H2,1-3H3
58 atoms
Si -3.827999 0.649824 0.674867
F  1.723994 -1.416597 1.206922
O  1.878087 2.631734 1.016235
O  1.429982 -0.106733 -1.206314
C  -4.240589 -0.089231 -1.025339
C  -4.221165 -1.616814 -1.195395
C  -2.04466 1.226377 0.818479
C  -4.208495 -0.563086 2.060815
C  -4.913571 2.180351 0.871508
C  -2.948302 -2.181435 -1.825255
C  -1.216691 0.853125 1.87192
C  -1.500612 2.101807 -0.131236
C  -1.69788 -1.980932 -1.016404
C  0.096212 1.30235 1.984681
C  -0.201436 2.562297 -0.041939
C  0.613906 2.155566 1.017328
C  -0.666351 -1.175728 -1.488071
C  -1.534564 -2.615884 0.213025
C  0.490981 -0.986952 -0.748927
C  -0.380387 -2.440618 0.960857
C  0.615991 -1.618757 0.478731
C  2.798226 2.125051 1.978323
C  4.145474 2.752163 1.723869
C  2.733197 -0.494137 -1.366031
C  3.671849 0.529467 -1.3888
C  3.121997 -1.815665 -1.539738
C  5.011276 0.224771 -1.574519
C  4.469016 -2.104415 -1.717667
C  5.41932 -1.093345 -1.733354
H  -5.255401 0.266255 -1.233082
H  -3.619816 0.385526 -1.793764
H  -5.049286 -1.913218 -1.844139
H  -4.407953 -2.121323 -0.242939
H  -3.553735 -1.436171 2.050936
H  -4.106302 -0.087315 3.038392
H  -5.236152 -0.925741 1.987477
H  -4.736738 2.898452 0.067395
H  -5.975222 1.92432 0.84922
H  -4.718227 2.694204 1.814824
H  -3.094872 -3.252523 -1.990179
H  -2.812773 -1.734703 -2.813252
H  -1.583079 0.181244 2.63955
H  -2.099377 2.431779 -0.973926
H  0.691177 0.97019 2.824331
H  0.197327 3.228465 -0.79747
H  -0.762868 -0.67152 -2.442498
H  -2.316595 -3.259564 0.596874
H  -0.257477 -2.927405 1.919834
H  2.860772 1.03528 1.896904
H  2.456453 2.362771 2.99066
H  4.109639 3.837156 1.822794
H  4.858651 2.375483 2.456807
H  4.526443 2.504345 0.732792
H  3.354044 1.556061 -1.258399
H  2.396364 -2.619476 -1.545257
H  5.738481 1.026229 -1.58783
H  4.771736 -3.135084 -1.848127
H  6.465939 -1.328835 -1.870588
elementType: Si F O C H
totalener: -1510.05044096 hartree
nucrepener: 3070.54213947 hartree
electener: -4580.59258043 hartree
oneelecener: -8172.77017688 hartree
twoeener: 3592.17759645 hartree
cpcmener: -0.02721154 hartree
kineticenergy: 1503.92562790 hartree
xcener: -135.237805395152 hartree
chargesum: -0.0000000
charge: 0.480844 -0.224626 -0.341951 -0.327059 -0.279057 -0.130026 -0.108897 -0.446803 -0.469656 -0.104281 -0.155700 -0.128052 0.093934 -0.232929 -0.286476 0.332567 -0.276107 -0.235805 0.199156 -0.149195 0.263701 0.036400 -0.272400 0.325073 -0.302460 -0.200421 -0.114018 -0.161501 -0.192590 0.110999 0.083078 0.088295 0.078778 0.106921 0.112043 0.115391 0.100651 0.100157 0.097291 0.097025 0.082928 0.143434 0.134519 0.134369 0.132853 0.128403 0.149148 0.147505 0.097850 0.114192 0.092912 0.093604 0.078410 0.147575 0.155482 0.162162 0.161932 0.160430
qa: 0.4808 -0.2246 -0.3420 -0.3271 -0.2791 -0.1300 -0.1089 -0.4468 -0.4697 -0.1043 -0.1557 -0.1281 0.0939 -0.2329 -0.2865 0.3326 -0.2761 -0.2358 0.1992 -0.1492 0.2637 0.0364 -0.2724 0.3251 -0.3025 -0.2004 -0.1140 -0.1615 -0.1926 0.1110 0.0831 0.0883 0.0788 0.1069 0.1120 0.1154 0.1007 0.1002 0.0973 0.0970 0.0829 0.1434 0.1345 0.1344 0.1329 0.1284 0.1491 0.1475 0.0979 0.1142 0.0929 0.0936 0.0784 0.1476 0.1555 0.1622 0.1619 0.1604
va: 4.0725 1.0500 2.0391 2.0059 3.8301 3.8786 3.6611 3.9022 3.9064 3.8438 3.8467 3.8463 3.5122 3.8052 3.9912 3.6846 4.0350 3.9022 3.5514 3.9051 3.8543 3.7749 3.9654 3.6598 3.9518 3.9037 3.8745 3.9076 3.9087 0.9985 1.0151 1.0045 0.9986 1.0098 1.0100 1.0072 1.0099 1.0109 1.0120 1.0033 1.0085 0.9884 0.9934 1.0132 1.0132 1.0211 0.9953 1.0013 0.9907 0.9910 1.0043 1.0056 1.0050 1.0186 1.0012 0.9885 0.9895 0.9895
dispcorr: -0.037291216 hartree
energy: -1510.087732175024
dipole: -17.54789 17.11528 -0.43261 5.13156 -6.33452 -1.20295 3.27353 -3.05881 0.21472
magnitude: 1.29628 au
magnitude: 3.29489 debye
