program: Orca
programVersion: 5.0.2
elementType: Si F O O C C C C C C C C C C C C C C C C C C C C C C C C C H H H H H H H H H H H H H H H H H H H H H H H H H H H H H
charge: 0
multiplicity: 1
keywords: wb97x-d3
keywords: def2-TZVPP
keywords: def2/J RIJCOSX
keywords: DEFGRID2
keywords: scfconv7
keywords: smallprint printgap noloewdin
keywords: NOSOSCF
formula: C25H29FO2Si
InChI: InChI=1/C25H29FO2Si/c1-4-27-21-13-15-23(16-14-21)29(2,3)18-8-9-20-12-17-24(26)25(19-20)28-22-10-6-5-7-11-22/h5-7,10-17,19H,4,8-9,18H2,1-3H3
58 atoms
Si -3.617161 0.776705 1.382161
F  1.493464 0.423619 -3.194888
O  2.171624 2.363036 0.560803
O  2.068388 -0.55896 -0.796994
C  -3.83611 -0.70564 0.235549
C  -2.968577 -1.902505 0.647167
C  -1.82946 1.326105 1.14869
C  -3.90238 0.284697 3.175515
C  -4.782702 2.167479 0.879353
C  -2.377678 -2.66684 -0.541302
C  -0.841024 1.133155 2.11825
C  -1.418567 1.889706 -0.060264
C  -1.35248 -1.850302 -1.278953
C  0.479376 1.488353 1.898858
C  -0.10209 2.259957 -0.302529
C  0.860266 2.061151 0.685578
C  -0.114644 -1.606618 -0.684704
C  -1.617829 -1.289195 -2.523056
C  0.850184 -0.853605 -1.332109
C  -0.666873 -0.510943 -3.172866
C  0.557415 -0.313945 -2.577791
C  2.650926 2.990412 -0.624613
C  2.355423 4.474549 -0.659213
C  2.732372 -1.502703 -0.055144
C  2.766894 -2.840984 -0.426616
C  3.424287 -1.056921 1.06154
C  3.494699 -3.736791 0.342171
C  4.159567 -1.963081 1.812935
C  4.192924 -3.305722 1.462785
H  -4.884786 -1.004504 0.158952
H  -3.558884 -0.355337 -0.765538
H  -3.560617 -2.588533 1.255653
H  -2.135812 -1.59229 1.288048
H  -3.719798 1.11549 3.859661
H  -4.934617 -0.03879 3.324862
H  -3.258535 -0.541687 3.482344
H  -4.611652 2.482292 -0.152141
H  -5.82592 1.853298 0.953249
H  -4.659016 3.046451 1.514741
H  -1.913506 -3.587879 -0.180026
H  -3.176907 -2.961902 -1.224976
H  -1.096704 0.691727 3.074817
H  -2.138919 2.055686 -0.854544
H  1.224977 1.324648 2.667847
H  0.148122 2.695793 -1.260266
H  0.098457 -2.02098 0.294213
H  -2.57483 -1.460198 -2.99914
H  -0.872815 -0.072491 -4.140864
H  2.266553 2.485817 -1.514549
H  3.728213 2.827147 -0.609412
H  2.783076 4.978894 0.207525
H  2.804658 4.908907 -1.55267
H  1.287576 4.69076 -0.6887
H  2.236068 -3.186516 -1.30455
H  3.394755 -0.010582 1.336072
H  3.519261 -4.77955 0.054556
H  4.701454 -1.613685 2.682084
H  4.76059 -4.010662 2.055039
elementType: Si F O C H
totalener: -1510.05156930 hartree
nucrepener: 3047.37314408 hartree
electener: -4557.42471338 hartree
oneelecener: -8126.35402675 hartree
twoeener: 3568.92931338 hartree
cpcmener: -0.02654838 hartree
kineticenergy: 1503.92436117 hartree
xcener: -135.238354726805 hartree
chargesum: 0.0000000
charge: 0.483404 -0.224062 -0.351438 -0.336868 -0.267325 -0.122213 -0.107435 -0.433772 -0.443442 -0.097055 -0.114443 -0.258453 0.067596 -0.282075 -0.164028 0.310569 -0.259625 -0.224344 0.243286 -0.136534 0.157548 0.058606 -0.263554 0.309839 -0.198069 -0.268402 -0.148096 -0.130051 -0.190719 0.096086 0.075564 0.094588 0.064234 0.108804 0.109318 0.102338 0.101012 0.103597 0.103038 0.097737 0.086361 0.144163 0.135359 0.138055 0.141287 0.147717 0.146221 0.148325 0.074145 0.108418 0.088839 0.095079 0.090555 0.156199 0.148958 0.162042 0.162440 0.160671
qa: 0.4834 -0.2241 -0.3514 -0.3369 -0.2673 -0.1222 -0.1074 -0.4338 -0.4434 -0.0971 -0.1144 -0.2585 0.0676 -0.2821 -0.1640 0.3106 -0.2596 -0.2243 0.2433 -0.1365 0.1575 0.0586 -0.2636 0.3098 -0.1981 -0.2684 -0.1481 -0.1301 -0.1907 0.0961 0.0756 0.0946 0.0642 0.1088 0.1093 0.1023 0.1010 0.1036 0.1030 0.0977 0.0864 0.1442 0.1354 0.1381 0.1413 0.1477 0.1462 0.1483 0.0741 0.1084 0.0888 0.0951 0.0906 0.1562 0.1490 0.1620 0.1624 0.1607
va: 4.1322 1.0583 2.0321 2.0228 3.8346 3.8749 3.6627 3.9132 3.9010 3.8604 3.8522 3.9411 3.6127 3.9920 3.7947 3.6611 3.8846 3.8865 3.5149 3.8800 4.0195 3.8318 3.9406 3.6844 3.9322 3.9620 3.8950 3.9067 3.9076 1.0120 1.0176 1.0079 1.0069 1.0074 1.0090 1.0077 1.0107 1.0102 1.0091 1.0048 1.0069 0.9876 0.9957 1.0098 1.0024 1.0074 1.0012 0.9985 1.0096 0.9913 1.0058 1.0079 1.0025 0.9969 1.0207 0.9891 0.9895 0.9894
dispcorr: -0.036046849 hartree
energy: -1510.087616152517
dipole: -20.30521 19.44909 -0.85612 5.12685 -5.85467 -0.72782 13.15234 -13.29771 -0.14537
magnitude: 1.13305 au
magnitude: 2.87998 debye
