program: Orca
programVersion: 5.0.2
elementType: Si F O O C C C C C C C C C C C C C C C C C C C C C C C C C H H H H H H H H H H H H H H H H H H H H H H H H H H H H H
charge: 0
multiplicity: 1
keywords: wb97x-d3
keywords: def2-TZVPP
keywords: def2/J RIJCOSX
keywords: DEFGRID2
keywords: scfconv7
keywords: smallprint printgap noloewdin
keywords: NOSOSCF
formula: C25H29FO2Si
InChI: InChI=1/C25H29FO2Si/c1-4-27-21-13-15-23(16-14-21)29(2,3)18-8-9-20-12-17-24(26)25(19-20)28-22-10-6-5-7-11-22/h5-7,10-17,19H,4,8-9,18H2,1-3H3
58 atoms
Si -3.938932 1.667101 0.533456
F  1.863864 -4.515403 -0.853964
O  1.741739 2.769187 -1.230137
O  2.043424 -1.8377 -0.904844
C  -4.490769 0.048866 -0.301876
C  -3.378225 -0.943391 -0.638299
C  -2.164621 2.044127 0.030226
C  -4.037219 1.541168 2.409878
C  -5.073779 3.051853 -0.053802
C  -2.620901 -1.452556 0.588023
C  -1.810747 2.172918 -1.319472
C  -1.135235 2.16519 0.960617
C  -1.430292 -2.287634 0.212709
C  -0.50811 2.408439 -1.715607
C  0.183919 2.405335 0.588707
C  0.504655 2.530393 -0.760148
C  -0.235968 -1.666563 -0.146278
C  -1.495784 -3.677021 0.175159
C  0.872226 -2.415554 -0.506233
C  -0.394941 -4.43845 -0.192095
C  0.782959 -3.799706 -0.516129
C  2.799985 2.984981 -0.305037
C  4.054525 3.2688 -1.091756
C  2.840383 -1.197875 0.000053
C  2.566936 -1.120872 1.359691
C  3.991211 -0.615204 -0.521108
C  3.454707 -0.448887 2.191457
C  4.870283 0.040999 0.324369
C  4.606727 0.133139 1.685648
H  -5.242891 -0.430946 0.335134
H  -5.020139 0.312208 -1.223754
H  -2.667433 -0.475952 -1.325264
H  -3.792176 -1.802677 -1.175877
H  -3.399311 0.753448 2.81568
H  -3.753135 2.477705 2.8949
H  -5.05983 1.317426 2.723421
H  -4.837109 4.00095 0.432021
H  -4.994743 3.20861 -1.131962
H  -6.12085 2.827107 0.163467
H  -2.277084 -0.607505 1.190125
H  -3.298687 -2.029233 1.222846
H  -2.567938 2.083612 -2.09184
H  -1.346753 2.0698 2.019664
H  -0.261655 2.502917 -2.766568
H  0.938118 2.489543 1.359734
H  -0.16356 -0.583429 -0.139203
H  -2.418444 -4.178932 0.439502
H  -0.448617 -5.519375 -0.216577
H  2.936922 2.103276 0.329264
H  2.56134 3.830581 0.349262
H  4.884646 3.434439 -0.404944
H  4.319722 2.434345 -1.741879
H  3.947471 4.164339 -1.705301
H  1.682406 -1.576115 1.784861
H  4.196264 -0.687107 -1.582145
H  3.234764 -0.388376 3.249679
H  5.766374 0.487129 -0.08744
H  5.291233 0.653353 2.342352
elementType: Si F O C H
totalener: -1510.07004549 hartree
nucrepener: 2954.63053835 hartree
electener: -4464.70058384 hartree
oneelecener: -7939.39120767 hartree
twoeener: 3474.69062383 hartree
cpcmener: -0.02193013 hartree
kineticenergy: 1503.91049442 hartree
xcener: -135.232157025660 hartree
chargesum: -0.0000000
charge: 0.480891 -0.216407 -0.327015 -0.326333 -0.288391 -0.131057 -0.131879 -0.431404 -0.448266 -0.068998 -0.146696 -0.159528 0.006387 -0.275620 -0.229668 0.352471 -0.163464 -0.169045 0.158385 -0.191880 0.227648 0.073758 -0.288566 0.331619 -0.213617 -0.236664 -0.160276 -0.147702 -0.173405 0.086307 0.099275 0.082106 0.093140 0.104530 0.107073 0.109146 0.099876 0.100115 0.100935 0.076952 0.097028 0.137640 0.144980 0.132751 0.133767 0.090632 0.140820 0.147183 0.052853 0.116985 0.093990 0.086359 0.099383 0.152018 0.141382 0.157858 0.155146 0.154496
qa: 0.4809 -0.2164 -0.3270 -0.3263 -0.2884 -0.1311 -0.1319 -0.4314 -0.4483 -0.0690 -0.1467 -0.1595 0.0064 -0.2756 -0.2297 0.3525 -0.1635 -0.1690 0.1584 -0.1919 0.2276 0.0738 -0.2886 0.3316 -0.2136 -0.2367 -0.1603 -0.1477 -0.1734 0.0863 0.0993 0.0821 0.0931 0.1045 0.1071 0.1091 0.0999 0.1001 0.1009 0.0770 0.0970 0.1376 0.1450 0.1328 0.1338 0.0906 0.1408 0.1472 0.0529 0.1170 0.0940 0.0864 0.0994 0.1520 0.1414 0.1579 0.1551 0.1545
va: 4.0888 1.0726 2.0680 2.0888 3.8543 3.8586 3.7179 3.8996 3.8990 3.7337 3.8775 3.8655 3.6536 4.0289 3.8332 3.7135 3.8901 3.8870 3.7233 3.8972 4.0451 3.7616 3.9656 3.6437 3.8525 3.9133 3.8998 3.8644 3.8529 1.0126 1.0080 1.0091 1.0109 1.0088 1.0073 1.0113 1.0113 1.0114 1.0099 1.0227 1.0121 0.9905 0.9901 1.0143 1.0131 1.0416 1.0030 0.9992 0.9920 0.9949 1.0038 1.0032 1.0075 1.0017 1.0124 0.9905 0.9897 0.9920
dispcorr: -0.033707051 hartree
energy: -1510.103752541031
dipole: -18.27214 17.66240 -0.60974 25.05890 -24.50333 0.55557 8.14520 -6.90386 1.24134
magnitude: 1.49043 au
magnitude: 3.78836 debye
