program: Orca
programVersion: 5.0.2
elementType: Si F O O C C C C C C C C C C C C C C C C C C C C C C C C C H H H H H H H H H H H H H H H H H H H H H H H H H H H H H
charge: 0
multiplicity: 1
keywords: wb97x-d3
keywords: def2-TZVPP
keywords: def2/J RIJCOSX
keywords: DEFGRID2
keywords: scfconv7
keywords: smallprint printgap noloewdin
keywords: NOSOSCF
formula: C25H29FO2Si
InChI: InChI=1/C25H29FO2Si/c1-4-27-21-13-15-23(16-14-21)29(2,3)18-8-9-20-12-17-24(26)25(19-20)28-22-10-6-5-7-11-22/h5-7,10-17,19H,4,8-9,18H2,1-3H3
58 atoms
Si -3.785395 1.305706 0.021984
F  1.878296 -3.503848 -1.302528
O  2.124204 2.376875 0.733027
O  1.862677 -1.488066 0.584296
C  -4.009607 -0.384175 -0.811927
C  -4.168448 -1.586582 0.118721
C  -1.959696 1.652438 0.313432
C  -4.720175 1.384398 1.65402
C  -4.459277 2.622079 -1.146896
C  -2.975225 -1.871643 1.028786
C  -1.098134 1.820509 -0.778193
C  -1.389675 1.744077 1.580317
C  -1.696809 -2.258089 0.331673
C  0.251053 2.067294 -0.615502
C  -0.030646 1.977229 1.771668
C  0.801113 2.140788 0.667108
C  -0.497129 -1.644357 0.679883
C  -1.664983 -3.272914 -0.622531
C  0.707585 -2.051486 0.130044
C  -0.467366 -3.685484 -1.188845
C  0.709677 -3.085776 -0.794633
C  2.752177 2.440741 2.006749
C  4.200975 2.803585 1.79771
C  2.75208 -0.921289 -0.286164
C  4.056575 -0.795913 0.174312
C  2.396613 -0.450974 -1.543192
C  5.011352 -0.195445 -0.631404
C  3.36545 0.14675 -2.338392
C  4.672827 0.277201 -1.892616
H  -4.902587 -0.315164 -1.443046
H  -3.180629 -0.548002 -1.5097
H  -4.391869 -2.480701 -0.471626
H  -5.043501 -1.437771 0.757489
H  -4.630861 2.370765 2.114651
H  -5.785936 1.200695 1.499108
H  -4.369553 0.651547 2.383286
H  -3.977752 2.58519 -2.126782
H  -5.531499 2.491261 -1.311447
H  -4.309775 3.62792 -0.74877
H  -2.779877 -1.010252 1.672459
H  -3.252002 -2.685691 1.706521
H  -1.484063 1.76407 -1.790875
H  -2.006978 1.62549 2.463987
H  0.892549 2.204874 -1.477351
H  0.353588 2.026803 2.781714
H  -0.485627 -0.847025 1.413457
H  -2.578958 -3.77143 -0.920406
H  -0.44327 -4.486403 -1.917074
H  2.664463 1.475946 2.518366
H  2.264026 3.193748 2.63452
H  4.714262 2.069172 1.176409
H  4.303854 3.784356 1.332013
H  4.707666 2.837719 2.762353
H  4.318139 -1.16798 1.157171
H  1.379769 -0.531187 -1.906212
H  6.027437 -0.10281 -0.269886
H  3.087095 0.514517 -3.317773
H  5.420254 0.743209 -2.520883
elementType: Si F O C H
totalener: -1510.06905983 hartree
nucrepener: 3025.98059314 hartree
electener: -4536.04965297 hartree
oneelecener: -8083.12743611 hartree
twoeener: 3547.07778314 hartree
cpcmener: -0.02421470 hartree
kineticenergy: 1503.91495128 hartree
xcener: -135.235201040737 hartree
chargesum: 0.0000000
charge: 0.484503 -0.217506 -0.323497 -0.325128 -0.261685 -0.158016 -0.101615 -0.441289 -0.460810 -0.076579 -0.107509 -0.182233 0.018840 -0.300567 -0.226550 0.334288 -0.267762 -0.196662 0.169204 -0.174164 0.261645 0.032261 -0.276931 0.362957 -0.302809 -0.221720 -0.122995 -0.145042 -0.180961 0.096748 0.080211 0.090753 0.088758 0.112632 0.113358 0.103595 0.099679 0.101879 0.100254 0.077953 0.101592 0.130796 0.142547 0.135023 0.134626 0.163697 0.140344 0.146864 0.101353 0.110504 0.088562 0.090146 0.092264 0.141260 0.149761 0.158451 0.158003 0.156721
qa: 0.4845 -0.2175 -0.3235 -0.3251 -0.2617 -0.1580 -0.1016 -0.4413 -0.4608 -0.0766 -0.1075 -0.1822 0.0188 -0.3006 -0.2265 0.3343 -0.2678 -0.1967 0.1692 -0.1742 0.2616 0.0323 -0.2769 0.3630 -0.3028 -0.2217 -0.1230 -0.1450 -0.1810 0.0967 0.0802 0.0908 0.0888 0.1126 0.1134 0.1036 0.0997 0.1019 0.1003 0.0780 0.1016 0.1308 0.1425 0.1350 0.1346 0.1637 0.1403 0.1469 0.1014 0.1105 0.0886 0.0901 0.0923 0.1413 0.1498 0.1585 0.1580 0.1567
va: 4.0804 1.0680 2.0585 2.0495 3.8342 3.9081 3.6458 3.9104 3.9024 3.7855 3.8624 3.8708 3.6779 3.9943 3.8655 3.7165 3.9331 3.9078 3.7704 3.9264 3.9567 3.7874 3.9708 3.4879 3.9741 3.8674 3.8356 3.9068 3.9018 1.0061 1.0161 1.0019 1.0007 1.0095 1.0081 1.0085 1.0119 1.0110 1.0107 1.0149 1.0029 0.9963 0.9889 1.0118 1.0119 0.9945 1.0041 1.0002 0.9849 0.9901 1.0021 1.0037 1.0071 1.0122 1.0060 0.9885 0.9902 0.9895
dispcorr: -0.036000338 hartree
energy: -1510.105060169935
dipole: -19.59997 18.73643 -0.86354 18.84700 -18.63153 0.21547 7.52759 -6.92250 0.60509
magnitude: 1.07623 au
magnitude: 2.73555 debye
