program: Orca
programVersion: 5.0.2
elementType: Si F O O C C C C C C C C C C C C C C C C C C C C C C C C C H H H H H H H H H H H H H H H H H H H H H H H H H H H H H
charge: 0
multiplicity: 1
keywords: wb97x-d3
keywords: def2-TZVPP
keywords: def2/J RIJCOSX
keywords: DEFGRID2
keywords: scfconv7
keywords: smallprint printgap noloewdin
keywords: NOSOSCF
formula: C25H29FO2Si
InChI: InChI=1/C25H29FO2Si/c1-4-27-21-13-15-23(16-14-21)29(2,3)18-8-9-20-12-17-24(26)25(19-20)28-22-10-6-5-7-11-22/h5-7,10-17,19H,4,8-9,18H2,1-3H3
58 atoms
Si -3.619115 1.009484 0.334895
F  1.402474 -2.244727 1.992362
O  2.192244 2.112772 1.582691
O  1.995982 -0.802016 -0.147067
C  -3.886465 0.345108 -1.421368
C  -3.840609 -1.164242 -1.691469
C  -1.813019 1.313628 0.754293
C  -4.387061 -0.138648 1.613201
C  -4.500337 2.678685 0.401021
C  -2.467472 -1.729981 -2.052955
C  -0.994681 2.064978 -0.099042
C  -1.232908 0.849997 1.931128
C  -1.45826 -1.823632 -0.940067
C  0.328887 2.325205 0.197963
C  0.097869 1.097866 2.253639
C  0.88995 1.834299 1.379629
C  -0.205986 -1.23177 -1.075409
C  -1.729733 -2.554884 0.213986
C  0.766703 -1.381477 -0.096498
C  -0.773588 -2.695831 1.209039
C  0.464985 -2.116154 1.040188
C  2.865349 1.502381 2.676165
C  4.328514 1.856084 2.579425
C  2.640849 -0.644338 -1.343829
C  2.66344 -1.641028 -2.312145
C  3.336163 0.541287 -1.532203
C  3.379198 -1.431043 -3.481775
C  4.056738 0.731945 -2.70224
C  4.076361 -0.247619 -3.684885
H  -4.888946 0.703466 -1.683657
H  -3.219554 0.867643 -2.117091
H  -4.49596 -1.382132 -2.539351
H  -4.264264 -1.724275 -0.852293
H  -4.369349 0.305988 2.610691
H  -5.434456 -0.336967 1.373403
H  -3.879423 -1.102793 1.675153
H  -4.377607 3.160626 1.373403
H  -4.112384 3.368525 -0.352474
H  -5.573033 2.57444 0.220693
H  -2.616035 -2.736686 -2.456136
H  -2.046564 -1.141083 -2.871966
H  -1.391851 2.455303 -1.030503
H  -1.818619 0.267686 2.63332
H  0.942127 2.901028 -0.485147
H  0.492973 0.707934 3.182106
H  0.012606 -0.647406 -1.961257
H  -2.693126 -3.033075 0.34109
H  -0.983576 -3.263327 2.10687
H  2.73249 0.415813 2.643363
H  2.448656 1.858475 3.624308
H  4.485302 2.934731 2.616722
H  4.864011 1.413506 3.419608
H  4.773968 1.47098 1.661301
H  2.133446 -2.573362 -2.162548
H  3.319167 1.304983 -0.765393
H  3.393879 -2.206243 -4.237208
H  4.599743 1.657338 -2.844791
H  4.632981 -0.092891 -4.599722
elementType: Si F O C H
totalener: -1510.06688365 hartree
nucrepener: 3064.05668963 hartree
electener: -4574.12357328 hartree
oneelecener: -8159.40950503 hartree
twoeener: 3585.28593175 hartree
cpcmener: -0.02187748 hartree
kineticenergy: 1503.90652239 hartree
xcener: -135.234633452448 hartree
chargesum: 0.0000000
charge: 0.469451 -0.224052 -0.328891 -0.320422 -0.279187 -0.125203 -0.063548 -0.440421 -0.459435 -0.091847 -0.139454 -0.190360 0.046194 -0.280335 -0.218531 0.338191 -0.185473 -0.262146 0.218065 -0.140362 0.177061 0.049789 -0.271424 0.328364 -0.208765 -0.267131 -0.142775 -0.128057 -0.186344 0.105582 0.078377 0.089157 0.075444 0.109860 0.113834 0.104168 0.097584 0.099046 0.099146 0.100086 0.079016 0.128514 0.139080 0.131058 0.130941 0.138130 0.144461 0.142402 0.086567 0.103932 0.087902 0.092373 0.085667 0.152742 0.138968 0.157941 0.157918 0.157152
qa: 0.4695 -0.2241 -0.3289 -0.3204 -0.2792 -0.1252 -0.0635 -0.4404 -0.4594 -0.0918 -0.1395 -0.1904 0.0462 -0.2803 -0.2185 0.3382 -0.1855 -0.2621 0.2181 -0.1404 0.1771 0.0498 -0.2714 0.3284 -0.2088 -0.2671 -0.1428 -0.1281 -0.1863 0.1056 0.0784 0.0892 0.0754 0.1099 0.1138 0.1042 0.0976 0.0990 0.0991 0.1001 0.0790 0.1285 0.1391 0.1311 0.1309 0.1381 0.1445 0.1424 0.0866 0.1039 0.0879 0.0924 0.0857 0.1527 0.1390 0.1579 0.1579 0.1572
va: 4.1033 1.0576 2.0628 2.0346 3.8504 3.8906 3.6539 3.8974 3.9083 3.8451 3.8859 3.8892 3.6090 3.9652 3.8171 3.6950 3.8892 3.9013 3.5649 3.8824 4.0044 3.7931 3.9694 3.6702 3.9446 3.9501 3.8937 3.9158 3.9148 0.9996 1.0163 1.0008 0.9993 1.0099 1.0080 1.0119 1.0117 1.0104 1.0111 0.9991 1.0115 0.9959 0.9913 1.0121 1.0130 1.0128 0.9973 1.0015 0.9996 0.9891 1.0041 1.0066 1.0019 0.9989 1.0262 0.9902 0.9910 0.9905
dispcorr: -0.036766208 hartree
energy: -1510.103649862428
dipole: -17.66714 17.06940 -0.59774 9.99237 -10.53156 -0.53919 -2.87387 2.26102 -0.61285
magnitude: 1.01173 au
magnitude: 2.57162 debye
