program: Orca
programVersion: 5.0.2
elementType: Si F O O C C C C C C C C C C C C C C C C C C C C C C C C C H H H H H H H H H H H H H H H H H H H H H H H H H H H H H
charge: 0
multiplicity: 1
keywords: wb97x-d3
keywords: def2-TZVPP
keywords: def2/J RIJCOSX
keywords: DEFGRID2
keywords: scfconv7
keywords: smallprint printgap noloewdin
keywords: NOSOSCF
formula: C25H29FO2Si
InChI: InChI=1/C25H29FO2Si/c1-4-27-21-13-15-23(16-14-21)29(2,3)18-8-9-20-12-17-24(26)25(19-20)28-22-10-6-5-7-11-22/h5-7,10-17,19H,4,8-9,18H2,1-3H3
58 atoms
Si -3.483738 1.367481 0.751309
F  1.7702 -4.004957 0.199454
O  2.415804 2.630175 0.259647
O  1.673826 -1.703293 -1.305403
C  -3.630106 -0.447085 0.230728
C  -3.484095 -0.658771 -1.276626
C  -1.674958 1.864658 0.575364
C  -4.018643 1.560796 2.545378
C  -4.547786 2.444818 -0.367543
C  -3.183826 -2.104317 -1.677498
C  -0.823308 1.948932 1.682881
C  -1.093233 2.086533 -0.673287
C  -1.864245 -2.610457 -1.157985
C  0.52566 2.225063 1.552755
C  0.262132 2.350977 -0.831705
C  1.087378 2.413832 0.288805
C  -0.685622 -1.91133 -1.418874
C  -1.784571 -3.777756 -0.406997
C  0.535599 -2.372782 -0.962436
C  -0.56505 -4.254845 0.057743
C  0.58331 -3.554176 -0.230887
C  3.066223 2.926554 -0.969065
C  2.855982 4.35886 -1.413023
C  2.481995 -1.182277 -0.332831
C  2.06877 -0.974383 0.97584
C  3.767232 -0.835544 -0.733002
C  2.967018 -0.439575 1.890329
C  4.647591 -0.294332 0.190118
C  4.255946 -0.099374 1.508685
H  -2.854517 -1.000861 0.772605
H  -4.583657 -0.863714 0.572675
H  -2.697677 -0.018261 -1.686501
H  -4.402878 -0.342688 -1.777333
H  -3.466776 0.898373 3.215543
H  -3.885137 2.582444 2.9068
H  -5.077374 1.314967 2.65669
H  -5.592035 2.12373 -0.349382
H  -4.522942 3.490961 -0.054844
H  -4.218992 2.411316 -1.408478
H  -3.984215 -2.759017 -1.323899
H  -3.189004 -2.175153 -2.769707
H  -1.214166 1.794971 2.682516
H  -1.701695 2.05711 -1.570481
H  1.159517 2.284121 2.429433
H  0.648199 2.504383 -1.830445
H  -0.701842 -0.99532 -1.998268
H  -2.685899 -4.333817 -0.181163
H  -0.507645 -5.168762 0.635243
H  2.767936 2.219437 -1.748917
H  4.124374 2.751265 -0.773637
H  3.432659 4.543311 -2.320536
H  1.812651 4.584229 -1.635515
H  3.201336 5.059772 -0.652095
H  1.060912 -1.21089 1.293387
H  4.073671 -0.997252 -1.759174
H  2.644238 -0.282886 2.911536
H  5.648621 -0.029394 -0.125467
H  4.947439 0.317753 2.228651
elementType: Si F O C H
totalener: -1510.06898579 hartree
nucrepener: 3003.51864885 hartree
electener: -4513.58763463 hartree
oneelecener: -8038.21832746 hartree
twoeener: 3524.63069283 hartree
cpcmener: -0.02514580 hartree
kineticenergy: 1503.90786318 hartree
xcener: -135.232904270408 hartree
chargesum: -0.0000000
charge: 0.482297 -0.216394 -0.330462 -0.326347 -0.241747 -0.129951 -0.143069 -0.461978 -0.423831 -0.103342 -0.071630 -0.188818 -0.027111 -0.327846 -0.233945 0.348190 -0.219722 -0.146609 0.170742 -0.176685 0.251426 0.041293 -0.264303 0.313125 -0.157953 -0.259481 -0.183213 -0.145493 -0.163229 0.080807 0.086733 0.071905 0.092109 0.100422 0.106453 0.105612 0.106447 0.108284 0.101887 0.080432 0.098941 0.139572 0.146679 0.131328 0.136507 0.134517 0.140412 0.147629 0.088553 0.106460 0.093812 0.091914 0.088897 0.144109 0.140879 0.155588 0.154818 0.154380
qa: 0.4823 -0.2164 -0.3305 -0.3263 -0.2417 -0.1300 -0.1431 -0.4620 -0.4238 -0.1033 -0.0716 -0.1888 -0.0271 -0.3278 -0.2339 0.3482 -0.2197 -0.1466 0.1707 -0.1767 0.2514 0.0413 -0.2643 0.3131 -0.1580 -0.2595 -0.1832 -0.1455 -0.1632 0.0808 0.0867 0.0719 0.0921 0.1004 0.1065 0.1056 0.1064 0.1083 0.1019 0.0804 0.0989 0.1396 0.1467 0.1313 0.1365 0.1345 0.1404 0.1476 0.0886 0.1065 0.0938 0.0919 0.0889 0.1441 0.1409 0.1556 0.1548 0.1544
va: 4.1345 1.0697 2.0436 2.0633 3.8117 3.8796 3.7294 3.9291 3.8853 3.8610 3.8285 3.8999 3.7026 4.0226 3.8904 3.6554 3.9458 3.8707 3.7276 3.9206 3.9698 3.8401 3.9537 3.6054 3.8003 3.9435 3.8804 3.8584 3.8679 1.0155 1.0114 1.0039 1.0077 1.0102 1.0096 1.0121 1.0065 1.0097 1.0086 1.0089 1.0012 0.9876 0.9808 1.0154 1.0088 1.0130 1.0016 0.9994 0.9919 0.9903 1.0077 1.0021 1.0050 1.0107 1.0115 0.9923 0.9907 0.9906
dispcorr: -0.034703532 hartree
energy: -1510.103689317053
dipole: -20.07231 19.17784 -0.89446 24.27786 -23.85778 0.42007 -1.48228 0.91792 -0.56436
magnitude: 1.13799 au
magnitude: 2.89255 debye
