program: Orca
programVersion: 5.0.2
elementType: Si F O O C C C C C C C C C C C C C C C C C C C C C C C C C H H H H H H H H H H H H H H H H H H H H H H H H H H H H H
charge: 0
multiplicity: 1
keywords: wb97x-d3
keywords: def2-TZVPP
keywords: def2/J RIJCOSX
keywords: DEFGRID2
keywords: scfconv7
keywords: smallprint printgap noloewdin
keywords: NOSOSCF
formula: C25H29FO2Si
InChI: InChI=1/C25H29FO2Si/c1-4-27-21-13-15-23(16-14-21)29(2,3)18-8-9-20-12-17-24(26)25(19-20)28-22-10-6-5-7-11-22/h5-7,10-17,19H,4,8-9,18H2,1-3H3
58 atoms
Si -2.866347 1.155603 1.063339
F  0.763129 -3.353765 -3.904162
O  1.549868 5.292031 0.978364
O  1.817996 -3.358206 -1.475044
C  -2.169345 -0.584326 0.837665
C  -3.247156 -1.652451 0.659022
C  -1.453828 2.400678 1.046957
C  -3.792062 1.297273 2.698022
C  -4.05142 1.558045 -0.345854
C  -2.691695 -3.075172 0.514238
C  -0.140989 2.04578 0.74633
C  -1.690761 3.754488 1.320357
C  -1.773349 -3.212062 -0.666861
C  0.894482 2.974535 0.710948
C  -0.680307 4.696393 1.291809
C  0.627744 4.312705 0.984505
C  -0.393938 -3.240247 -0.48977
C  -2.283408 -3.253908 -1.962862
C  0.46329 -3.28288 -1.58051
C  -1.437912 -3.310665 -3.060558
C  -0.07381 -3.312402 -2.858053
C  2.901333 4.973548 0.674843
C  3.70455 6.248475 0.745486
C  2.491085 -2.594121 -0.562673
C  2.081426 -1.318446 -0.194775
C  3.659442 -3.138823 -0.047372
C  2.849563 -0.597949 0.709315
C  4.422891 -2.400456 0.843954
C  4.018319 -1.131367 1.23428
H  -1.505919 -0.581564 -0.034116
H  -1.534377 -0.833278 1.695666
H  -3.856161 -1.421748 -0.220477
H  -3.933157 -1.64407 1.511324
H  -4.181992 2.305831 2.853269
H  -4.645527 0.616306 2.737168
H  -3.147723 1.063886 3.548333
H  -4.946872 0.933191 -0.315079
H  -4.384097 2.59767 -0.300672
H  -3.581185 1.410348 -1.320725
H  -2.159865 -3.349647 1.428682
H  -3.527663 -3.772673 0.415528
H  0.106731 1.013228 0.526497
H  -2.692341 4.094058 1.563154
H  1.89284 2.635754 0.467429
H  -0.893129 5.737108 1.50582
H  0.017155 -3.223375 0.51277
H  -3.354709 -3.242389 -2.122687
H  -1.832825 -3.344828 -4.068056
H  2.971643 4.532087 -0.325095
H  3.287809 4.238952 1.389479
H  4.748333 6.032924 0.516735
H  3.350795 6.985616 0.023761
H  3.666331 6.691482 1.741262
H  1.179134 -0.880557 -0.603583
H  3.968853 -4.131662 -0.349387
H  2.527616 0.39337 1.002235
H  5.334263 -2.828038 1.241488
H  4.610051 -0.5614 1.938238
elementType: Si F O C H
totalener: -1510.07053793 hartree
nucrepener: 2816.50582591 hartree
electener: -4326.57636384 hartree
oneelecener: -7662.47535741 hartree
twoeener: 3335.89899358 hartree
cpcmener: -0.02479688 hartree
kineticenergy: 1503.91503496 hartree
xcener: -135.230453212847 hartree
chargesum: 0.0000000
charge: 0.512348 -0.217773 -0.324999 -0.327314 -0.248747 -0.151826 -0.216876 -0.430609 -0.429518 -0.096688 -0.094383 -0.080133 0.017849 -0.262938 -0.297926 0.351511 -0.215233 -0.206714 0.225434 -0.170158 0.180327 0.065052 -0.274063 0.305402 -0.214255 -0.261222 -0.114573 -0.103908 -0.220594 0.068380 0.091012 0.083259 0.086883 0.102256 0.101552 0.105015 0.103002 0.105515 0.107042 0.083651 0.097491 0.108463 0.130524 0.133302 0.131748 0.144802 0.142671 0.147750 0.093208 0.091632 0.088915 0.087102 0.086928 0.166108 0.144251 0.157948 0.156783 0.155333
qa: 0.5123 -0.2178 -0.3250 -0.3273 -0.2487 -0.1518 -0.2169 -0.4306 -0.4295 -0.0967 -0.0944 -0.0801 0.0178 -0.2629 -0.2979 0.3515 -0.2152 -0.2067 0.2254 -0.1702 0.1803 0.0651 -0.2741 0.3054 -0.2143 -0.2612 -0.1146 -0.1039 -0.2206 0.0684 0.0910 0.0833 0.0869 0.1023 0.1016 0.1050 0.1030 0.1055 0.1070 0.0837 0.0975 0.1085 0.1305 0.1333 0.1317 0.1448 0.1427 0.1478 0.0932 0.0916 0.0889 0.0871 0.0869 0.1661 0.1443 0.1579 0.1568 0.1553
va: 4.1315 1.0680 2.0853 2.0874 3.8568 3.9095 3.8900 3.8857 3.8779 3.8429 3.8885 3.8317 3.6379 3.8927 4.0504 3.7705 3.9055 3.9010 3.6645 3.8886 4.0690 3.7967 3.9743 3.7324 3.8928 4.0036 3.8527 3.8748 3.9733 1.0194 1.0133 1.0009 1.0083 1.0108 1.0088 1.0065 1.0051 1.0105 1.0058 1.0119 1.0056 0.9925 0.9939 1.0122 1.0155 1.0059 1.0014 0.9985 0.9860 0.9863 1.0056 1.0034 1.0036 0.9914 1.0089 0.9891 0.9884 0.9935
dispcorr: -0.028983912 hartree
energy: -1510.099521841693
dipole: -12.37078 12.18995 -0.18082 23.26238 -23.10411 0.15827 19.21198 -18.31534 0.89664
magnitude: 0.92828 au
magnitude: 2.35950 debye
