program: Orca
programVersion: 5.0.2
elementType: Si F O O C C C C C C C C C C C C C C C C C C C C C C C C C H H H H H H H H H H H H H H H H H H H H H H H H H H H H H
charge: 0
multiplicity: 1
keywords: wb97x-d3
keywords: def2-TZVPP
keywords: def2/J RIJCOSX
keywords: DEFGRID2
keywords: scfconv7
keywords: smallprint printgap noloewdin
keywords: NOSOSCF
formula: C25H29FO2Si
InChI: InChI=1/C25H29FO2Si/c1-4-27-21-13-15-23(16-14-21)29(2,3)18-8-9-20-12-17-24(26)25(19-20)28-22-10-6-5-7-11-22/h5-7,10-17,19H,4,8-9,18H2,1-3H3
58 atoms
Si -3.574434 1.809434 0.614842
F  1.219569 -5.612839 0.231403
O  2.253076 3.418835 0.92026
O  2.041326 -3.14287 -0.159701
C  -3.619842 0.435269 -0.686712
C  -2.739945 -0.750242 -0.296641
C  -1.78522 2.384912 0.754783
C  -4.149916 1.137372 2.27624
C  -4.661537 3.249782 0.080549
C  -2.521973 -1.762604 -1.423729
C  -0.884095 1.800337 1.65378
C  -1.270674 3.361151 -0.096988
C  -1.536165 -2.827221 -1.027501
C  0.450953 2.159285 1.692845
C  0.066403 3.742566 -0.075731
C  0.940732 3.13447 0.821775
C  -0.202046 -2.470087 -0.818014
C  -1.91927 -4.143753 -0.81454
C  0.731255 -3.404343 -0.403488
C  -0.99206 -5.091728 -0.392231
C  0.31392 -4.715784 -0.189188
C  2.81576 4.39937 0.058754
C  4.287447 4.508782 0.370173
C  2.543607 -1.899524 -0.464199
C  2.751555 -1.530557 -1.785827
C  2.877783 -1.049629 0.577393
C  3.299924 -0.286118 -2.060247
C  3.437202 0.188577 0.290244
C  3.643128 0.575992 -1.02651
H  -4.650724 0.108127 -0.860649
H  -3.273445 0.858758 -1.636941
H  -3.16923 -1.266566 0.567177
H  -1.759837 -0.3885 0.029168
H  -5.178609 0.77443 2.213289
H  -3.537964 0.303449 2.625738
H  -4.124233 1.906488 3.051387
H  -5.708528 2.94543 0.012187
H  -4.609638 4.078015 0.790598
H  -4.378294 3.6402 -0.89909
H  -3.473511 -2.220142 -1.704935
H  -2.155388 -1.232899 -2.308191
H  -1.223575 1.038711 2.346993
H  -1.920059 3.854662 -0.81201
H  1.124286 1.688206 2.399181
H  0.402956 4.508211 -0.761944
H  0.09885 -1.441611 -0.977941
H  -2.94808 -4.442666 -0.971731
H  -1.286915 -6.119322 -0.221013
H  2.322804 5.365316 0.212902
H  2.66693 4.115386 -0.988508
H  4.807763 3.565491 0.197325
H  4.739056 5.26048 -0.277662
H  4.457608 4.814285 1.403201
H  2.488424 -2.205739 -2.590902
H  2.709768 -1.356123 1.602332
H  3.461583 0.008299 -3.089252
H  3.710082 0.849749 1.101936
H  4.079492 1.541581 -1.248016
elementType: Si F O C H
totalener: -1510.07118185 hartree
nucrepener: 2873.74426965 hartree
electener: -4383.81545150 hartree
oneelecener: -7777.85545633 hartree
twoeener: 3394.04000483 hartree
cpcmener: -0.02438250 hartree
kineticenergy: 1503.90118027 hartree
xcener: -135.226646131893 hartree
chargesum: -0.0000000
charge: 0.500971 -0.220490 -0.324510 -0.329258 -0.253071 -0.116123 -0.169473 -0.430209 -0.454927 -0.069422 -0.087085 -0.140755 -0.021383 -0.322232 -0.259092 0.360492 -0.218885 -0.215261 0.238404 -0.152662 0.174795 0.030087 -0.273477 0.248374 -0.175864 -0.188916 -0.156327 -0.169474 -0.141298 0.084576 0.074461 0.087872 0.067272 0.107048 0.100372 0.110200 0.104153 0.105464 0.100013 0.080274 0.089942 0.143598 0.135889 0.136314 0.137354 0.136489 0.138590 0.146416 0.108766 0.098727 0.084111 0.093424 0.092452 0.154083 0.146472 0.158485 0.153055 0.161197
qa: 0.5010 -0.2205 -0.3245 -0.3293 -0.2531 -0.1161 -0.1695 -0.4302 -0.4549 -0.0694 -0.0871 -0.1408 -0.0214 -0.3222 -0.2591 0.3605 -0.2189 -0.2153 0.2384 -0.1527 0.1748 0.0301 -0.2735 0.2484 -0.1759 -0.1889 -0.1563 -0.1695 -0.1413 0.0846 0.0745 0.0879 0.0673 0.1070 0.1004 0.1102 0.1042 0.1055 0.1000 0.0803 0.0899 0.1436 0.1359 0.1363 0.1374 0.1365 0.1386 0.1464 0.1088 0.0987 0.0841 0.0934 0.0925 0.1541 0.1465 0.1585 0.1531 0.1612
va: 4.1385 1.0626 2.0578 2.0771 3.8393 3.8752 3.7346 3.8926 3.9174 3.8067 3.8043 3.9399 3.7655 4.0156 3.9294 3.7090 3.8817 3.9072 3.6702 3.8816 4.0426 3.8021 3.9681 3.7129 3.9427 3.9921 3.9273 3.8641 3.8377 1.0151 1.0167 1.0059 1.0060 1.0079 1.0088 1.0076 1.0107 1.0093 1.0110 1.0144 1.0064 0.9884 0.9917 1.0112 1.0116 1.0078 1.0047 0.9989 0.9891 0.9837 1.0018 1.0059 1.0034 0.9976 1.0045 0.9908 1.0016 0.9847
dispcorr: -0.030400777 hartree
energy: -1510.101582627860
dipole: -16.02560 15.47314 -0.55246 34.20349 -32.33979 1.86371 -0.80306 -0.18781 -0.99087
magnitude: 2.18184 au
magnitude: 5.54581 debye
