program: Orca
programVersion: 5.0.2
elementType: Si F O O C C C C C C C C C C C C C C C C C C C C C C C C C H H H H H H H H H H H H H H H H H H H H H H H H H H H H H
charge: 0
multiplicity: 1
keywords: wb97x-d3
keywords: def2-TZVPP
keywords: def2/J RIJCOSX
keywords: DEFGRID2
keywords: scfconv7
keywords: smallprint printgap noloewdin
keywords: NOSOSCF
formula: C25H29FO2Si
InChI: InChI=1/C25H29FO2Si/c1-4-27-21-13-15-23(16-14-21)29(2,3)18-8-9-20-12-17-24(26)25(19-20)28-22-10-6-5-7-11-22/h5-7,10-17,19H,4,8-9,18H2,1-3H3
58 atoms
Si -3.322463 1.207449 0.822936
F  1.159345 -4.944281 0.455492
O  2.217715 3.324807 -0.402602
O  1.514142 -2.389361 1.128241
C  -3.580642 -0.633108 0.454925
C  -3.645424 -1.058478 -1.012834
C  -1.605121 1.849584 0.392858
C  -3.58213 1.438281 2.674823
C  -4.594263 2.20238 -0.145509
C  -2.294347 -1.085621 -1.73449
C  -1.367044 2.607555 -0.751975
C  -0.503003 1.608242 1.222458
C  -1.352316 -2.111914 -1.167594
C  -0.110253 3.110261 -1.069149
C  0.757135 2.096114 0.92909
C  0.96571 2.861899 -0.220516
C  -0.321205 -1.740639 -0.311638
C  -1.524544 -3.464623 -1.456403
C  0.529552 -2.69157 0.236225
C  -0.687016 -4.424746 -0.910456
C  0.335899 -4.02844 -0.074387
C  2.529247 4.118391 -1.541131
C  2.757454 3.296616 -2.79134
C  2.393062 -1.370843 0.886733
C  2.994199 -0.80469 2.003888
C  2.728712 -0.938201 -0.390171
C  3.937149 0.19865 1.839602
C  3.666036 0.074989 -0.536289
C  4.273848 0.64975 0.570576
H  -2.836733 -1.228356 0.99544
H  -4.536636 -0.881463 0.931449
H  -4.316571 -0.394067 -1.564948
H  -4.093078 -2.054896 -1.086774
H  -3.411504 2.47182 2.983203
H  -4.60101 1.173825 2.967234
H  -2.908462 0.808203 3.2600
H  -5.606071 1.858031 0.081848
H  -4.55031 3.264813 0.103181
H  -4.464124 2.115408 -1.226189
H  -2.470678 -1.305847 -2.790358
H  -1.829411 -0.098188 -1.69901
H  -2.17893 2.829815 -1.435329
H  -0.621239 1.025646 2.129983
H  0.000511 3.694025 -1.973003
H  1.588541 1.89965 1.595362
H  -0.175928 -0.694279 -0.069521
H  -2.321914 -3.777576 -2.119471
H  -0.819037 -5.474835 -1.138441
H  3.445738 4.644705 -1.272915
H  1.763248 4.882801 -1.702548
H  3.018784 3.962357 -3.615203
H  3.582941 2.596864 -2.656894
H  1.875566 2.730501 -3.092661
H  2.728027 -1.153886 2.993868
H  2.276753 -1.379563 -1.268855
H  4.403883 0.634269 2.713769
H  3.922973 0.411049 -1.532604
H  5.003263 1.438846 0.445405
elementType: Si F O C H
totalener: -1510.06694921 hartree
nucrepener: 2989.11576618 hartree
electener: -4499.18271539 hartree
oneelecener: -8008.82251826 hartree
twoeener: 3509.63980287 hartree
cpcmener: -0.02349046 hartree
kineticenergy: 1503.90969615 hartree
xcener: -135.236158646972 hartree
chargesum: 0.0000000
charge: 0.507450 -0.217579 -0.328739 -0.326490 -0.279022 -0.150895 -0.202669 -0.453762 -0.449025 -0.086167 -0.137839 -0.068743 -0.023300 -0.232915 -0.325768 0.339384 -0.173199 -0.188166 0.218992 -0.187880 0.195865 0.038596 -0.268753 0.309659 -0.253175 -0.177745 -0.112647 -0.168568 -0.202939 0.083816 0.100227 0.084957 0.093108 0.104550 0.104273 0.101154 0.110727 0.113358 0.099247 0.099726 0.081362 0.143014 0.135245 0.137711 0.153406 0.127690 0.142227 0.146367 0.109079 0.089430 0.100891 0.084094 0.093634 0.141733 0.148298 0.153640 0.170744 0.152329
qa: 0.5075 -0.2176 -0.3287 -0.3265 -0.2790 -0.1509 -0.2027 -0.4538 -0.4490 -0.0862 -0.1378 -0.0687 -0.0233 -0.2329 -0.3258 0.3394 -0.1732 -0.1882 0.2190 -0.1879 0.1959 0.0386 -0.2688 0.3097 -0.2532 -0.1777 -0.1126 -0.1686 -0.2029 0.0838 0.1002 0.0850 0.0931 0.1046 0.1043 0.1012 0.1107 0.1134 0.0992 0.0997 0.0814 0.1430 0.1352 0.1377 0.1534 0.1277 0.1422 0.1464 0.1091 0.0894 0.1009 0.0841 0.0936 0.1417 0.1483 0.1536 0.1707 0.1523
va: 4.1418 1.0693 2.0717 2.0893 3.8333 3.8996 3.7156 3.9044 3.9098 3.8211 3.8375 3.7862 3.7091 3.9167 3.9941 3.7654 3.8096 3.8901 3.6519 3.8991 4.0476 3.8500 3.9107 3.6540 3.9685 3.8594 3.8503 3.8389 3.8736 1.0143 1.0074 1.0023 0.9994 1.0083 1.0095 1.0098 1.0068 1.0077 1.0055 1.0081 1.0151 0.9884 0.9943 1.0037 1.0043 1.0126 1.0002 0.9993 0.9925 0.9977 1.0116 1.0061 1.0021 1.0103 1.0029 0.9899 0.9780 0.9949
dispcorr: -0.034808303 hartree
energy: -1510.101757512345
dipole: -18.00586 17.32962 -0.67625 27.02428 -25.65325 1.37103 -8.90416 7.37446 -1.52970
magnitude: 2.16264 au
magnitude: 5.49699 debye
