program: Orca
programVersion: 5.0.2
elementType: Si F O O C C C C C C C C C C C C C C C C C C C C C C C C C H H H H H H H H H H H H H H H H H H H H H H H H H H H H H
charge: 0
multiplicity: 1
keywords: wb97x-d3
keywords: def2-TZVPP
keywords: def2/J RIJCOSX
keywords: DEFGRID2
keywords: scfconv7
keywords: smallprint printgap noloewdin
keywords: NOSOSCF
formula: C25H29FO2Si
InChI: InChI=1/C25H29FO2Si/c1-4-27-21-13-15-23(16-14-21)29(2,3)18-8-9-20-12-17-24(26)25(19-20)28-22-10-6-5-7-11-22/h5-7,10-17,19H,4,8-9,18H2,1-3H3
58 atoms
Si -3.46317 1.345394 0.208461
F  1.141999 -4.486274 -2.005141
O  2.296555 3.128572 0.786851
O  1.296508 -1.822002 -1.960411
C  -3.679988 -0.499111 -0.177663
C  -3.580828 -1.461678 1.006905
C  -1.664988 1.860236 0.441047
C  -4.426289 1.766579 1.770536
C  -4.150164 2.314091 -1.255184
C  -2.164946 -1.660992 1.556894
C  -1.160751 2.264268 1.675502
C  -0.771786 1.88849 -0.637851
C  -1.26822 -2.410201 0.610297
C  0.155138 2.681539 1.847103
C  0.540892 2.297456 -0.493593
C  1.017281 2.709396 0.75403
C  -0.362468 -1.742145 -0.206278
C  -1.357187 -3.798226 0.509501
C  0.443838 -2.44093 -1.094261
C  -0.556033 -4.507534 -0.371253
C  0.345387 -3.820482 -1.158174
C  2.866011 3.604831 1.999684
C  3.338416 2.492678 2.91155
C  2.272769 -0.990432 -1.489822
C  2.79481 -0.083834 -2.40425
C  2.766331 -1.049208 -0.192834
C  3.811905 0.772766 -2.013047
C  3.78087 -0.179487 0.184306
C  4.306126 0.735957 -0.716042
H  -4.680031 -0.589379 -0.617752
H  -2.992834 -0.797956 -0.977135
H  -3.980302 -2.440807 0.722847
H  -4.219783 -1.110179 1.821826
H  -4.410319 2.838527 1.97874
H  -5.474176 1.475008 1.66686
H  -4.038446 1.256571 2.654771
H  -4.049557 3.391415 -1.106931
H  -3.633196 2.065003 -2.184802
H  -5.210676 2.103025 -1.410979
H  -1.717133 -0.695568 1.804329
H  -2.232717 -2.218065 2.494671
H  -1.801477 2.264263 2.550068
H  -1.100826 1.583678 -1.625919
H  0.478475 2.983208 2.834375
H  1.206519 2.312884 -1.348219
H  -0.279516 -0.662688 -0.151438
H  -2.059743 -4.338571 1.132449
H  -0.621093 -5.585916 -0.441072
H  2.171594 4.274344 2.51597
H  3.716642 4.212669 1.689568
H  4.106437 1.887716 2.429285
H  3.777673 2.928423 3.810183
H  2.53088 1.831338 3.226505
H  2.405376 -0.053181 -3.414303
H  2.378271 -1.761575 0.523783
H  4.212694 1.479737 -2.728134
H  4.162869 -0.226876 1.195864
H  5.094058 1.411975 -0.411617
elementType: Si F O C H
totalener: -1510.06701833 hartree
nucrepener: 2985.44258235 hartree
electener: -4495.50960068 hartree
oneelecener: -8001.56056818 hartree
twoeener: 3506.05096749 hartree
cpcmener: -0.02405019 hartree
kineticenergy: 1503.90835081 hartree
xcener: -135.234675786303 hartree
chargesum: -0.0000000
charge: 0.494911 -0.217167 -0.330673 -0.328381 -0.280300 -0.151316 -0.189578 -0.450156 -0.446758 -0.088461 -0.141376 -0.081248 -0.015592 -0.222137 -0.317373 0.334767 -0.165204 -0.176627 0.187119 -0.197430 0.216047 0.036277 -0.272154 0.321379 -0.264876 -0.181462 -0.113266 -0.171979 -0.198241 0.100252 0.083557 0.093301 0.086524 0.114260 0.113355 0.100520 0.101984 0.101369 0.103203 0.082424 0.099356 0.142918 0.135567 0.137584 0.148049 0.129689 0.142294 0.146865 0.092179 0.111038 0.082441 0.102756 0.095660 0.141608 0.147554 0.154846 0.163983 0.156121
qa: 0.4949 -0.2172 -0.3307 -0.3284 -0.2803 -0.1513 -0.1896 -0.4502 -0.4468 -0.0885 -0.1414 -0.0812 -0.0156 -0.2221 -0.3174 0.3348 -0.1652 -0.1766 0.1871 -0.1974 0.2160 0.0363 -0.2722 0.3214 -0.2649 -0.1815 -0.1133 -0.1720 -0.1982 0.1003 0.0836 0.0933 0.0865 0.1143 0.1134 0.1005 0.1020 0.1014 0.1032 0.0824 0.0994 0.1429 0.1356 0.1376 0.1480 0.1297 0.1423 0.1469 0.0922 0.1110 0.0824 0.1028 0.0957 0.1416 0.1476 0.1548 0.1640 0.1561
va: 4.1210 1.0703 2.0627 2.0843 3.8395 3.9001 3.7000 3.9164 3.9023 3.8128 3.8512 3.7991 3.7051 3.9135 3.9824 3.7494 3.8143 3.8845 3.6803 3.9056 4.0367 3.8446 3.9135 3.6307 3.9621 3.8606 3.8605 3.8614 3.8546 1.0071 1.0148 1.0014 1.0005 1.0084 1.0066 1.0044 1.0085 1.0098 1.0095 1.0154 1.0083 0.9885 0.9955 1.0041 1.0037 1.0144 1.0001 0.9993 0.9985 0.9922 1.0051 1.0120 1.0011 1.0105 1.0043 0.9893 0.9835 0.9902
dispcorr: -0.034749553 hartree
energy: -1510.101767884147
dipole: -16.39136 15.93412 -0.45724 22.54056 -21.78076 0.75980 19.02208 -17.09677 1.92530
magnitude: 2.11971 au
magnitude: 5.38787 debye
