program: Gaussian 09
title: 000063621
version: EM64L-G09RevD.01
frameworkgroup: C1[X(C27H17Cl2N3O)]
method: RPBEPBE
basis: SDD
operation: Freq
keyword: #p
keyword: freq=noraman
keyword: PBEPBE/SDD
title: #p freq=noraman PBEPBE/SDD
converged: YES YES NO NO
title: Mulliken charges:
elementType: Cl Cl O N N N C C C C C C C C C C C C C C C C C C C C C C C C C C C H H H H H H H H H H H H H H H H H
charge: -0.013620 -0.033323 -0.230996 -0.348668 -0.044389 -0.070931 0.032810 0.148047 0.113729 0.069833 0.302569 0.572812 -0.319985 -0.353493 -0.298342 -0.356653 -0.272367 -0.298592 -0.244561 -0.204204 -0.401913 -0.360247 0.254432 -0.213018 -0.223093 -0.110733 -0.377375 0.434015 -0.366658 -0.370241 -0.231078 -0.219541 -0.228029 0.271789 0.262232 0.251166 0.265790 0.275366 0.235167 0.234356 0.255973 0.244395 0.281594 0.263307 0.222186 0.229193 0.275798 0.231358 0.231426 0.232706
chargesum: 0.00000
title: Mulliken charges with hydrogens summed into heavy atoms:
elementType: Cl Cl O N N N C C C C C C C C C C C C C C C C C C C C C C C C C C C
charge: -0.013620 -0.033323 -0.230996 -0.348668 -0.044389 -0.070931 0.032810 0.148047 0.113729 0.069833 0.302569 0.572812 -0.048195 -0.091261 -0.047175 -0.090863 -0.272367 -0.023226 -0.009394 0.030152 -0.145940 -0.115852 0.254432 0.068576 0.040215 -0.110733 -0.155190 0.434015 -0.137466 -0.094443 0.000280 0.011885 0.004677
chargesum: -0.00002
polarizability: 6.49789422e+02 6.07293156e+01 3.48925313e+02 2.11018905e+01 -3.79723276e+01 2.33992398e+02
1716.lowfreq: -5.0505 -1.7861 -1.1168 -0.8028 -0.0701 -0.0535 14.0341 19.5306 27.5734
frequency: 14.0082 19.5002 27.5609 29.5334 38.1937 42.4273 58.5339 61.9039 82.1100 105.6884 117.0158 130.8236 138.9519 157.8938 166.9817 171.5968 180.9146 209.7585 244.1858 252.4200 274.5414 300.5070 301.0190 328.5984 349.5372 367.5527 371.9137 388.4062 404.6093 411.8518 429.1390 440.4991 452.5438 455.8281 497.8281 504.9724 512.3156 531.2817 546.4137 549.2628 553.0288 590.7058 607.4410 614.4178 627.7319 641.6455 662.0882 664.0850 679.0396 691.8082 698.4934 709.2116 744.3828 749.1268 773.1420 782.3449 792.2529 798.7359 814.6773 828.5604 831.2187 834.3254 857.5798 862.1463 863.4002 874.9173 896.1983 912.6749 932.0967 950.9079 961.6405 971.8811 979.6899 985.2390 988.3601 990.1748 1002.7187 1003.7205 1006.7510 1008.3691 1021.9371 1026.6868 1063.9109 1080.6108 1081.4250 1100.3248 1104.3456 1118.9924 1141.1075 1165.1192 1167.4555 1173.3491 1180.7751 1199.9631 1212.0798 1231.4230 1246.2017 1250.9723 1258.4352 1287.6140 1300.8474 1312.4711 1320.0304 1351.4639 1357.2752 1369.7949 1377.7673 1392.6035 1398.6180 1420.6077 1440.7930 1449.2160 1457.9377 1461.6015 1480.0470 1496.1156 1522.1900 1557.1476 1563.1902 1571.1322 1576.6088 1590.6926 1594.0126 1611.1915 1613.7073 1620.7036 1625.8149 2949.1777 3118.5053 3131.3346 3136.1690 3136.6941 3144.8898 3150.6529 3155.1247 3158.9544 3163.3423 3165.4707 3168.8892 3169.5428 3174.8093 3177.7389 3182.7201 3184.8677
redmass: 8.4851 5.4973 4.6678 8.5147 8.4429 8.0812 5.4625 4.8785 5.3136 8.3354 6.2819 5.6466 6.2200 6.8750 6.7248 7.2395 9.0267 10.3497 5.8978 4.3332 3.5768 9.1637 6.1226 7.2885 5.7658 6.2782 10.4890 6.0606 2.8400 2.9599 3.9083 8.2575 3.7584 3.9507 6.2510 7.0791 3.6484 4.0037 3.6560 7.8754 4.0221 7.9608 5.7312 6.4512 7.0416 5.6978 7.2404 6.6348 4.6670 4.9345 1.8327 4.6635 4.9636 5.1948 1.7757 1.6597 2.7696 3.3371 2.3215 1.4497 3.4388 1.9006 1.2513 1.5432 3.1716 4.1349 1.4988 7.5348 1.3700 1.3744 1.3751 1.3790 1.3739 1.5586 4.5896 1.5514 1.3628 3.0039 4.0216 1.3726 2.1337 2.4394 3.0349 1.6716 2.6471 3.3793 2.3469 1.3533 1.3359 1.6490 1.2090 1.0793 1.1103 1.6030 2.2840 3.0604 1.4870 1.9995 2.4727 2.7660 1.3289 1.4988 2.8910 3.2378 5.1532 2.4112 5.1885 10.3360 3.7666 4.2047 2.2391 2.6487 2.6744 2.8355 2.3681 2.9189 9.8489 7.2067 7.0037 8.7571 6.6699 7.3544 6.0494 8.2394 6.2997 8.5339 6.8725 1.0864 1.0879 1.0869 1.0862 1.0888 1.0918 1.0900 1.0880 1.0959 1.0894 1.0955 1.0950 1.1006 1.0999 1.0964 1.0948 1.0963
irintensity: 0.1764 0.2609 0.2124 0.6241 0.2876 0.3916 0.2740 0.3000 1.9302 3.1715 0.0711 0.1507 0.6138 2.5026 0.8008 2.4114 0.2500 0.9176 1.5840 17.0922 3.5063 0.4789 4.5369 2.4665 0.9822 2.6319 3.0734 4.1524 0.2208 1.5366 2.8927 14.6414 8.6037 6.2543 0.9834 1.1688 3.6325 5.8017 28.3591 4.4260 2.0603 20.3738 4.9282 0.3630 9.0864 26.7940 4.5877 10.3121 12.0224 5.9850 52.3201 4.8161 25.8682 12.1805 41.5835 71.4171 7.7552 13.0104 19.7159 32.3499 24.2730 32.5473 0.5267 33.9090 13.7823 24.6696 0.8920 20.7106 3.2930 1.8707 1.4557 3.7767 2.6127 21.8558 1.6615 7.5150 0.2349 4.4182 26.7464 4.5145 7.7135 18.3982 18.8239 12.9703 49.9701 0.2678 47.6438 8.7411 5.8999 117.0987 37.3093 1.4002 4.1006 4.7113 15.8843 59.9696 31.4030 6.5304 22.0787 23.5147 2.0467 32.3468 110.2075 6.9903 7.6478 4.6661 12.8210 79.9516 6.0008 20.3791 22.2898 16.8780 111.4354 133.8970 2.7363 104.9661 465.7396 49.1270 0.7903 28.2062 144.4687 67.0202 114.5965 203.6424 21.4717 74.0694 27.0723 41.0980 7.4829 0.0066 4.8943 9.3707 20.1582 8.5867 5.9302 24.8755 1.9743 12.4425 4.3475 35.8940 29.9416 5.4276 0.2075 1.0900
temp: 298.150 k
press: 1.00000 atm
elementType: 17 17 8 7 7 7 6 6 6 6 6 6 6 6 6 6 6 6 6 6 6 6 6 6 6 6 6 6 6 6 6 6 6 1 1 1 1 1 1 1 1 1 1 1 1 1 1 1 1 1
symmnumber: 1
zpe: 955940.3 jmol-1
zpe.correction: 0.364098 hartree
zpe.thermalcorrener: 0.391181 hartree
zpe.thermalcorrenthalpy: 0.392125 hartree
zpe.thermalcorrgfe: 0.302807 hartree
zpe.sumelectzpe: -2196.458763 hartree
zpe.sumelectthermal: -2196.431681 hartree
zpe.sumelectthermalent: -2196.430737 hartree
zpe.sumelectthermalfe: -2196.520054 hartree
dipole: 3.0144 -1.7150 0.4675
dipole: 3.4995
quadrupole: -174.1397 -202.4740 -193.4004
quadrupole: 10.9307 7.9895 -8.9759
quadrupole: 15.8650 -12.4693 -3.3957 10.9307 7.9895 -8.9759
hfenergy: -2196.8228616 hartree
pointgroup: C01 [X(C27H17Cl2N3O1)]
dipole: -1.1147421 -0.6950808 -0.4121127 debye
polarizability: 658.4271319|-35.4595812|308.6889701|9.6070744|62.5498384|265.5910309 unknown
InChI: InChI=1S/C27H17Cl2N3O/c28-20-12-15-25(23(29)16-20)32-26(31-24-9-5-4-8-22(24)27(32)33)19-10-13-21(14-11-19)30-17-18-6-2-1-3-7-18/h1-17H
charge 0 multiplicity 1
50 atoms
Cl 1.519995 1.959001 -1.95328
Cl 0.238419 5.907136 1.709075
O  4.78145 1.43344 1.070995
N  2.697297 0.477522 0.515021
N  2.532917 -1.726338 -0.44892
N  -3.788984 -0.903375 0.418986
C  1.95018 -0.646384 0.056459
C  4.761853 -0.767111 0.045038
C  4.147073 0.451009 0.593627
C  3.93092 -1.796476 -0.500334
C  0.465623 -0.650657 0.155964
C  2.082188 1.758467 0.792261
C  6.174854 -0.897935 0.020343
C  4.539568 -2.947211 -1.0759
C  -0.244949 -0.125143 1.270684
C  -0.26831 -1.304412 -0.870795
C  1.507107 2.54259 -0.235264
C  2.132618 2.294401 2.10004
C  6.761874 -2.03949 -0.54954
C  5.938699 -3.063218 -1.100947
C  -1.644175 -0.229591 1.341754
C  -1.668827 -1.384631 -0.819613
C  -2.382898 -0.827009 0.283599
C  0.930951 3.800688 0.02917
C  1.578778 3.555465 2.393595
C  0.973215 4.283628 1.350164
C  -4.58901 -0.773207 -0.611747
C  -6.046861 -0.943297 -0.502662
C  -6.859401 -0.759371 -1.655271
C  -6.661383 -1.289527 0.734312
C  -8.25925 -0.918053 -1.576459
C  -8.05802 -1.447057 0.810261
C  -8.861672 -1.262133 -0.343738
H  6.77873 -0.089375 0.444767
H  3.887418 -3.726308 -1.481595
H  0.293819 0.332479 2.104153
H  0.287861 -1.753682 -1.698644
H  2.623793 1.714545 2.886256
H  7.851577 -2.144169 -0.572038
H  6.402512 -3.951364 -1.544072
H  -2.192916 0.149449 2.209078
H  -2.215674 -1.909066 -1.611517
H  0.478228 4.38554 -0.774911
H  1.621299 3.963318 3.406568
H  -4.206592 -0.501804 -1.619425
H  -6.38964 -0.491323 -2.610286
H  -6.020135 -1.425743 1.611049
H  -8.878524 -0.774297 -2.46847
H  -8.527447 -1.712907 1.763835
H  -9.948649 -1.385413 -0.280526
