program: Orca
programVersion: 5.0.2
elementType: Si F O O C C C C C C C C C C C C C C C C C C C C C C C C C H H H H H H H H H H H H H H H H H H H H H H H H H H H H H
charge: 0
multiplicity: 1
keywords: wb97x-d3
keywords: def2-TZVPP
keywords: def2/J RIJCOSX
keywords: DEFGRID2
keywords: scfconv7
keywords: smallprint printgap noloewdin
keywords: NOSOSCF
formula: C25H29FO2Si
InChI: InChI=1/C25H29FO2Si/c1-4-27-21-13-15-23(16-14-21)29(2,3)18-8-9-20-12-17-24(26)25(19-20)28-22-10-6-5-7-11-22/h5-7,10-17,19H,4,8-9,18H2,1-3H3
58 atoms
Si -2.386097 1.542443 -0.401811
F  1.762467 -4.929332 0.085696
O  2.008916 4.136653 2.85115
O  1.474127 -3.011628 -1.764528
C  -2.552123 -0.281565 0.060503
C  -3.299981 -1.125437 -0.972077
C  -1.029265 2.313957 0.652015
C  -4.002804 2.466544 -0.114018
C  -1.90318 1.71155 -2.215464
C  -3.320638 -2.620253 -0.647856
C  -0.458326 1.659406 1.741257
C  -0.530386 3.588752 0.35455
C  -1.961197 -3.246525 -0.465223
C  0.55848 2.224998 2.504566
C  0.479134 4.172547 1.095654
C  1.034352 3.493307 2.183174
C  -0.871487 -2.841224 -1.23129
C  -1.764798 -4.248719 0.481415
C  0.385029 -3.393741 -1.038343
C  -0.520243 -4.836113 0.660001
C  0.546287 -4.395482 -0.093289
C  2.63783 3.493236 3.951506
C  3.694085 4.424813 4.4921
C  1.723324 -1.672071 -1.92014
C  1.540936 -0.758786 -0.88771
C  2.212253 -1.260622 -3.151597
C  1.845071 0.57803 -1.104532
C  2.519681 0.07801 -3.3508
C  2.331035 1.003664 -2.333793
H  -1.540294 -0.677294 0.196215
H  -3.038475 -0.374076 1.038022
H  -2.868764 -0.975392 -1.965616
H  -4.336579 -0.786935 -1.054897
H  -3.908555 3.524952 -0.367339
H  -4.81366 2.060425 -0.723719
H  -4.318411 2.409363 0.930055
H  -0.999679 1.142817 -2.448361
H  -2.695345 1.360426 -2.880441
H  -1.706423 2.753199 -2.479808
H  -3.903414 -2.785605 0.262057
H  -3.855667 -3.146683 -1.445219
H  -0.799211 0.668799 2.02062
H  -0.932772 4.149494 -0.482596
H  0.960439 1.664175 3.337833
H  0.847471 5.159504 0.841677
H  -0.986737 -2.066421 -1.98034
H  -2.593941 -4.57849 1.095291
H  -0.373574 -5.615015 1.397497
H  3.089631 2.548784 3.629962
H  1.900398 3.261097 4.727378
H  4.193376 3.953875 5.338975
H  4.452539 4.649584 3.741398
H  3.261169 5.363184 4.840351
H  1.171119 -1.077498 0.079233
H  2.351014 -1.98325 -3.946101
H  1.70446 1.289143 -0.30005
H  2.899999 0.396653 -4.312846
H  2.563788 2.047958 -2.495257
elementType: Si F O C H
totalener: -1510.06949577 hartree
nucrepener: 2895.21069425 hartree
electener: -4405.28019003 hartree
oneelecener: -7820.40813063 hartree
twoeener: 3415.12794060 hartree
cpcmener: -0.02301348 hartree
kineticenergy: 1503.89958675 hartree
xcener: -135.229996730516 hartree
chargesum: 0.0000000
charge: 0.442438 -0.217542 -0.324769 -0.335360 -0.241435 -0.114941 -0.123385 -0.425413 -0.416853 -0.111702 -0.207904 -0.119481 0.037799 -0.205798 -0.268385 0.329490 -0.235223 -0.198077 0.209915 -0.168760 0.184179 0.064208 -0.273895 0.282722 -0.189358 -0.250531 -0.125764 -0.095819 -0.213328 0.066643 0.098939 0.076262 0.090899 0.099399 0.099522 0.101361 0.093608 0.109678 0.107970 0.084238 0.091948 0.141435 0.131966 0.134704 0.133259 0.149953 0.140020 0.147741 0.093541 0.092258 0.088545 0.087086 0.086909 0.156976 0.145634 0.152875 0.156868 0.152734
qa: 0.4424 -0.2175 -0.3248 -0.3354 -0.2414 -0.1149 -0.1234 -0.4254 -0.4169 -0.1117 -0.2079 -0.1195 0.0378 -0.2058 -0.2684 0.3295 -0.2352 -0.1981 0.2099 -0.1688 0.1842 0.0642 -0.2739 0.2827 -0.1894 -0.2505 -0.1258 -0.0958 -0.2133 0.0666 0.0989 0.0763 0.0909 0.0994 0.0995 0.1014 0.0936 0.1097 0.1080 0.0842 0.0919 0.1414 0.1320 0.1347 0.1333 0.1500 0.1400 0.1477 0.0935 0.0923 0.0885 0.0871 0.0869 0.1570 0.1456 0.1529 0.1569 0.1527
va: 4.1229 1.0691 2.0833 2.0785 3.8655 3.8866 3.7433 3.9153 3.8843 3.8727 3.8843 3.8808 3.6386 3.8423 4.0336 3.7647 3.8905 3.9239 3.6700 3.8805 4.0751 3.7972 3.9751 3.7063 3.8571 4.0111 3.8086 3.8661 3.9284 1.0140 1.0144 1.0020 1.0074 1.0105 1.0095 1.0101 1.0126 1.0079 1.0129 1.0059 1.0023 0.9911 0.9940 1.0137 1.0143 0.9990 1.0010 0.9982 0.9865 0.9864 1.0058 1.0037 1.0034 0.9986 1.0074 0.9880 0.9878 0.9948
dispcorr: -0.031857817 hartree
energy: -1510.101353592169
dipole: -14.79483 13.84623 -0.94860 27.42137 -26.99787 0.42350 6.26365 -5.56924 0.69441
magnitude: 1.24956 au
magnitude: 3.17612 debye
