program: Orca
programVersion: 5.0.2
elementType: Si F O O C C C C C C C C C C C C C C C C C C C C C C C C C H H H H H H H H H H H H H H H H H H H H H H H H H H H H H
charge: 0
multiplicity: 1
keywords: wb97x-d3
keywords: def2-TZVPP
keywords: def2/J RIJCOSX
keywords: DEFGRID2
keywords: scfconv7
keywords: smallprint printgap noloewdin
keywords: NOSOSCF
formula: C25H29FO2Si
InChI: InChI=1/C25H29FO2Si/c1-4-27-21-13-15-23(16-14-21)29(2,3)18-8-9-20-12-17-24(26)25(19-20)28-22-10-6-5-7-11-22/h5-7,10-17,19H,4,8-9,18H2,1-3H3
58 atoms
Si -2.812772 1.601775 -0.143946
F  1.088058 -4.690968 -2.0350
O  2.534758 3.526753 1.94068
O  1.902765 -2.677815 -0.422835
C  -2.867111 -0.280931 0.011921
C  -2.607741 -0.812791 1.419272
C  -1.17652 2.222462 0.549927
C  -4.234274 2.394424 0.801549
C  -2.912403 2.054117 -1.971139
C  -2.596914 -2.342005 1.514759
C  0.02617 1.572513 0.246075
C  -1.088034 3.348596 1.364626
C  -1.607314 -3.00201 0.590715
C  1.243426 2.019589 0.724779
C  0.123754 3.820161 1.857459
C  1.304096 3.154285 1.537577
C  -0.289352 -2.553886 0.525135
C  -1.984754 -4.053377 -0.239908
C  0.612203 -3.124322 -0.355376
C  -1.083804 -4.647575 -1.115052
C  0.206333 -4.167861 -1.172656
C  2.691996 4.6140 2.84395
C  2.368726 4.242864 4.275133
C  2.170789 -1.59238 -1.21046
C  1.274681 -1.083649 -2.142368
C  3.419383 -1.00437 -1.039567
C  1.638471 0.023959 -2.898659
C  3.767019 0.097261 -1.805207
C  2.878547 0.621296 -2.736564
H  -3.839669 -0.634265 -0.349945
H  -2.131828 -0.692876 -0.688208
H  -3.371035 -0.438847 2.107619
H  -1.659206 -0.420714 1.796925
H  -4.26388 3.477659 0.666919
H  -5.192747 2.003246 0.452457
H  -4.176954 2.198633 1.87412
H  -2.891166 3.135737 -2.119386
H  -2.068145 1.635705 -2.524747
H  -3.825803 1.677569 -2.43679
H  -2.379097 -2.628693 2.548497
H  -3.596083 -2.727536 1.296853
H  0.025063 0.68815 -0.382035
H  -1.984985 3.892672 1.638612
H  2.157176 1.493611 0.472904
H  0.120616 4.700954 2.485383
H  0.049997 -1.738516 1.154215
H  -3.003896 -4.418915 -0.211761
H  -1.389114 -5.463186 -1.758287
H  2.109755 5.480209 2.515388
H  3.742766 4.893563 2.763213
H  2.566734 5.098913 4.921738
H  1.324694 3.960994 4.413948
H  2.993277 3.416731 4.616748
H  0.297485 -1.525868 -2.287117
H  4.109715 -1.409418 -0.309803
H  0.934285 0.418838 -3.619888
H  4.739087 0.552499 -1.665548
H  3.151639 1.485077 -3.328073
elementType: Si F O C H
totalener: -1510.06854004 hartree
nucrepener: 2920.91938548 hartree
electener: -4430.98792552 hartree
oneelecener: -7872.23580640 hartree
twoeener: 3441.24788088 hartree
cpcmener: -0.02351007 hartree
kineticenergy: 1503.90562434 hartree
xcener: -135.231092113239 hartree
chargesum: 0.0000000
charge: 0.457307 -0.215834 -0.332636 -0.333194 -0.275331 -0.112661 -0.215778 -0.445505 -0.411975 -0.112493 -0.038814 -0.084503 -0.014105 -0.310490 -0.281425 0.354429 -0.221315 -0.139005 0.182219 -0.186185 0.236827 0.044412 -0.259909 0.320610 -0.189411 -0.237817 -0.175848 -0.129667 -0.184005 0.090889 0.081447 0.091593 0.077874 0.104321 0.108621 0.106328 0.100590 0.099201 0.101114 0.095946 0.082195 0.126787 0.139927 0.123520 0.136442 0.139117 0.140436 0.148032 0.085203 0.107719 0.091831 0.090448 0.088702 0.143998 0.142005 0.156835 0.155476 0.155505
qa: 0.4573 -0.2158 -0.3326 -0.3332 -0.2753 -0.1127 -0.2158 -0.4455 -0.4120 -0.1125 -0.0388 -0.0845 -0.0141 -0.3105 -0.2814 0.3544 -0.2213 -0.1390 0.1822 -0.1862 0.2368 0.0444 -0.2599 0.3206 -0.1894 -0.2378 -0.1758 -0.1297 -0.1840 0.0909 0.0814 0.0916 0.0779 0.1043 0.1086 0.1063 0.1006 0.0992 0.1011 0.0959 0.0822 0.1268 0.1399 0.1235 0.1364 0.1391 0.1404 0.1480 0.0852 0.1077 0.0918 0.0904 0.0887 0.1440 0.1420 0.1568 0.1555 0.1555
va: 4.1374 1.0720 2.0828 2.0826 3.8593 3.8357 3.7903 3.9140 3.8863 3.8556 3.7600 3.7992 3.6736 4.0382 3.8980 3.7954 3.9398 3.8769 3.6877 3.9062 4.0247 3.8627 3.9121 3.6452 3.8093 3.9679 3.8755 3.8772 3.8776 1.0170 1.0120 1.0074 1.0068 1.0089 1.0086 1.0069 1.0098 1.0091 1.0086 1.0034 1.0084 0.9610 0.9885 1.0329 1.0084 1.0079 1.0005 0.9986 0.9960 0.9921 1.0093 1.0022 1.0053 1.0148 1.0101 0.9926 0.9898 0.9909
dispcorr: -0.032412685 hartree
energy: -1510.100952724687
dipole: -17.82416 16.56013 -1.26403 29.61044 -28.42053 1.18991 14.14958 -13.23116 0.91841
magnitude: 1.96396 au
magnitude: 4.99199 debye
