program: Orca
programVersion: 5.0.2
elementType: Si F O O C C C C C C C C C C C C C C C C C C C C C C C C C H H H H H H H H H H H H H H H H H H H H H H H H H H H H H
charge: 0
multiplicity: 1
keywords: wb97x-d3
keywords: def2-TZVPP
keywords: def2/J RIJCOSX
keywords: DEFGRID2
keywords: scfconv7
keywords: smallprint printgap noloewdin
keywords: NOSOSCF
formula: C25H29FO2Si
InChI: InChI=1/C25H29FO2Si/c1-4-27-21-13-15-23(16-14-21)29(2,3)18-8-9-20-12-17-24(26)25(19-20)28-22-10-6-5-7-11-22/h5-7,10-17,19H,4,8-9,18H2,1-3H3
58 atoms
Si -3.48245 1.216031 0.625717
F  1.497613 -1.481896 -3.014653
O  2.349939 2.539567 -0.330867
O  2.111329 -1.734596 -0.466397
C  -3.708338 -0.616433 0.228585
C  -3.007791 -1.565702 1.207033
C  -1.678693 1.655419 0.296699
C  -3.890419 1.564707 2.429325
C  -4.594711 2.233917 -0.504938
C  -2.566127 -2.895798 0.575207
C  -0.918232 2.429913 1.180324
C  -1.035567 1.22627 -0.865277
C  -1.464123 -2.664504 -0.419546
C  0.407706 2.736678 0.932613
C  0.295181 1.520798 -1.136733
C  1.036888 2.262674 -0.219929
C  -0.175169 -2.401887 0.044962
C  -1.713975 -2.586938 -1.784259
C  0.827313 -1.998255 -0.821537
C  -0.711747 -2.207976 -2.669147
C  0.53466 -1.898268 -2.178321
C  3.111715 1.989092 -1.398745
C  3.027368 2.815827 -2.663637
C  2.465124 -1.234955 0.757137
C  1.642396 -0.432844 1.537241
C  3.762359 -1.521079 1.166478
C  2.129113 0.072279 2.735234
C  4.236198 -1.0016 2.361033
C  3.421292 -0.205743 3.155224
H  -4.773897 -0.860101 0.16923
H  -3.328149 -0.760398 -0.788651
H  -3.674822 -1.7745 2.047003
H  -2.120906 -1.096383 1.647567
H  -3.233375 1.023203 3.11304
H  -3.812208 2.626499 2.67258
H  -4.914899 1.260668 2.656904
H  -4.365281 2.052752 -1.557587
H  -5.649478 1.991222 -0.355852
H  -4.477012 3.30506 -0.327651
H  -2.222375 -3.570578 1.363394
H  -3.419449 -3.377926 0.092038
H  -1.361333 2.799908 2.098175
H  -1.573279 0.633394 -1.597859
H  0.97758 3.31886 1.6471
H  0.733602 1.150427 -2.053482
H  0.031546 -2.495129 1.104121
H  -2.702485 -2.806391 -2.167518
H  -0.904651 -2.133263 -3.73181
H  2.828523 0.94865 -1.583231
H  4.139478 1.975744 -1.034044
H  3.359515 3.83937 -2.486201
H  3.679882 2.381809 -3.422631
H  2.01899 2.851627 -3.077054
H  0.635255 -0.188215 1.229246
H  4.396875 -2.141654 0.545738
H  1.483285 0.69718 3.338786
H  5.248984 -1.224368 2.671314
H  3.790718 0.196035 4.089444
elementType: Si F O C H
totalener: -1510.06610869 hartree
nucrepener: 3074.22541781 hartree
electener: -4584.29152650 hartree
oneelecener: -8178.85655487 hartree
twoeener: 3594.56502837 hartree
cpcmener: -0.02127707 hartree
kineticenergy: 1503.90393485 hartree
xcener: -135.237355755580 hartree
chargesum: -0.0000000
charge: 0.466106 -0.221576 -0.336613 -0.323346 -0.278748 -0.131032 -0.166804 -0.443986 -0.419265 -0.089497 -0.028173 -0.207484 0.065787 -0.365560 -0.196162 0.367239 -0.251566 -0.258537 0.263686 -0.112397 0.127868 0.072666 -0.268445 0.320418 -0.174953 -0.249111 -0.163259 -0.127076 -0.176308 0.096659 0.078652 0.093548 0.068143 0.108224 0.105866 0.110145 0.100219 0.100389 0.100666 0.093964 0.082708 0.137582 0.139670 0.128113 0.139169 0.152612 0.144693 0.146307 0.060920 0.107373 0.090260 0.093757 0.089515 0.129568 0.140993 0.153294 0.156741 0.156374
qa: 0.4661 -0.2216 -0.3366 -0.3233 -0.2787 -0.1310 -0.1668 -0.4440 -0.4193 -0.0895 -0.0282 -0.2075 0.0658 -0.3656 -0.1962 0.3672 -0.2516 -0.2585 0.2637 -0.1124 0.1279 0.0727 -0.2684 0.3204 -0.1750 -0.2491 -0.1633 -0.1271 -0.1763 0.0967 0.0787 0.0935 0.0681 0.1082 0.1059 0.1101 0.1002 0.1004 0.1007 0.0940 0.0827 0.1376 0.1397 0.1281 0.1392 0.1526 0.1447 0.1463 0.0609 0.1074 0.0903 0.0938 0.0895 0.1296 0.1410 0.1533 0.1567 0.1564
va: 4.1347 1.0587 2.0538 2.0676 3.8403 3.8886 3.7309 3.9120 3.8941 3.8751 3.7481 3.8746 3.5907 4.0290 3.7983 3.6426 3.9190 3.9041 3.6390 3.8576 3.9861 3.8315 3.9406 3.5992 3.8260 3.9941 3.9230 3.8927 3.9222 1.0135 1.0187 1.0081 1.0028 1.0054 1.0087 1.0087 1.0097 1.0099 1.0101 1.0077 1.0080 0.9862 0.9856 1.0181 1.0073 1.0006 1.0018 0.9984 1.0126 0.9938 1.0056 1.0080 1.0019 0.9952 1.0111 0.9952 0.9890 0.9906
dispcorr: -0.037658370 hartree
energy: -1510.103767063229
dipole: -19.13612 18.35901 -0.77711 11.48384 -11.90211 -0.41827 8.57585 -8.25256 0.32329
magnitude: 0.93988 au
magnitude: 2.38898 debye
