program: Orca
programVersion: 5.0.2
elementType: Si F O O C C C C C C C C C C C C C C C C C C C C C C C C C H H H H H H H H H H H H H H H H H H H H H H H H H H H H H
charge: 0
multiplicity: 1
keywords: wb97x-d3
keywords: def2-TZVPP
keywords: def2/J RIJCOSX
keywords: DEFGRID2
keywords: scfconv7
keywords: smallprint printgap noloewdin
keywords: NOSOSCF
formula: C25H29FO2Si
InChI: InChI=1/C25H29FO2Si/c1-4-27-21-13-15-23(16-14-21)29(2,3)18-8-9-20-12-17-24(26)25(19-20)28-22-10-6-5-7-11-22/h5-7,10-17,19H,4,8-9,18H2,1-3H3
58 atoms
Si -3.545821 1.772679 0.712668
F  1.688788 -5.290299 -0.107552
O  1.821502 3.969706 -1.01342
O  2.162146 -2.709745 -0.721398
C  -3.789953 0.250317 -0.385685
C  -2.744126 -0.829168 -0.116348
C  -1.871161 2.512415 0.26698
C  -3.539035 1.268409 2.525645
C  -4.907501 3.02744 0.382726
C  -2.644398 -1.886414 -1.218951
C  -1.740826 3.483444 -0.733517
C  -0.689099 2.053975 0.848496
C  -1.501922 -2.832087 -0.974153
C  -0.50693 3.959384 -1.138142
C  0.563366 2.510359 0.454879
C  0.660907 3.468256 -0.551239
C  -0.197188 -2.344249 -0.990104
C  -1.702207 -4.177681 -0.683445
C  0.87592 -3.166447 -0.695492
C  -0.632059 -5.018613 -0.405508
C  0.645878 -4.502183 -0.400664
C  3.044487 3.423992 -0.534934
C  4.177756 4.106948 -1.259277
C  2.542076 -1.729735 0.153338
C  1.853155 -1.442794 1.325828
C  3.698623 -1.031487 -0.173985
C  2.33419 -0.448257 2.167612
C  4.167951 -0.045714 0.680143
C  3.488094 0.25515 1.853692
H  -4.800648 -0.154284 -0.267521
H  -3.720224 0.584099 -1.427875
H  -2.954211 -1.322144 0.837432
H  -1.757922 -0.369058 -0.00075
H  -2.742943 0.557997 2.757865
H  -3.403581 2.13224 3.180113
H  -4.482717 0.793498 2.80447
H  -5.883053 2.624218 0.664358
H  -4.759001 3.947937 0.951048
H  -4.968613 3.300263 -0.672895
H  -3.582255 -2.44181 -1.294702
H  -2.501988 -1.380287 -2.178546
H  -2.622989 3.88338 -1.221672
H  -0.722806 1.309459 1.636677
H  -0.436777 4.709422 -1.917175
H  1.442556 2.106667 0.939594
H  -0.008011 -1.302132 -1.224481
H  -2.706841 -4.581698 -0.669787
H  -0.791762 -6.065287 -0.17958
H  3.07058 2.344353 -0.716878
H  3.134879 3.579763 0.545507
H  4.123679 3.941714 -2.335892
H  4.185945 5.181414 -1.072689
H  5.126272 3.70069 -0.907231
H  0.955103 -1.982485 1.597376
H  4.227129 -1.264383 -1.090173
H  1.795357 -0.227595 3.080315
H  5.069928 0.49398 0.420615
H  3.854647 1.02861 2.51566
elementType: Si F O C H
totalener: -1510.07105604 hartree
nucrepener: 2886.24589056 hartree
electener: -4396.31694660 hartree
oneelecener: -7802.18332139 hartree
twoeener: 3405.86637479 hartree
cpcmener: -0.02302305 hartree
kineticenergy: 1503.90963795 hartree
xcener: -135.229590286554 hartree
chargesum: 0.0000000
charge: 0.489559 -0.216594 -0.326592 -0.332232 -0.255700 -0.092315 -0.145268 -0.423028 -0.454929 -0.068120 -0.098408 -0.191667 -0.000185 -0.280137 -0.225345 0.323290 -0.199223 -0.176054 0.166491 -0.178373 0.210517 0.074019 -0.276611 0.297945 -0.177442 -0.209727 -0.190946 -0.168988 -0.162474 0.085710 0.073927 0.088504 0.046674 0.099433 0.109138 0.107197 0.104381 0.105904 0.099529 0.080228 0.089633 0.135283 0.149729 0.131799 0.133336 0.144834 0.140755 0.147457 0.083574 0.094271 0.088049 0.089058 0.088709 0.151488 0.145095 0.158537 0.158719 0.157585
qa: 0.4896 -0.2166 -0.3266 -0.3322 -0.2557 -0.0923 -0.1453 -0.4230 -0.4549 -0.0681 -0.0984 -0.1917 -0.0002 -0.2801 -0.2253 0.3233 -0.1992 -0.1761 0.1665 -0.1784 0.2105 0.0740 -0.2766 0.2979 -0.1774 -0.2097 -0.1909 -0.1690 -0.1625 0.0857 0.0739 0.0885 0.0467 0.0994 0.1091 0.1072 0.1044 0.1059 0.0995 0.0802 0.0896 0.1353 0.1497 0.1318 0.1333 0.1448 0.1408 0.1475 0.0836 0.0943 0.0880 0.0891 0.0887 0.1515 0.1451 0.1585 0.1587 0.1576
va: 4.1451 1.0709 2.0917 2.0823 3.8439 3.8791 3.7512 3.8880 3.9242 3.8092 3.8858 3.9132 3.6835 4.0410 3.8373 3.7945 3.9329 3.8946 3.7014 3.8808 4.0612 3.7969 3.9801 3.6939 3.8236 3.9534 3.8740 3.8748 3.8100 1.0142 1.0166 1.0068 1.0088 1.0098 1.0083 1.0075 1.0111 1.0094 1.0113 1.0144 1.0063 0.9890 0.9851 1.0152 1.0292 1.0019 1.0031 0.9987 0.9916 0.9828 1.0035 1.0039 1.0058 1.0023 1.0076 0.9919 0.9883 0.9914
dispcorr: -0.031088060 hartree
energy: -1510.102144104488
dipole: -16.13811 15.51458 -0.62353 28.06260 -27.69314 0.36945 4.50637 -4.03414 0.47223
magnitude: 0.86504 au
magnitude: 2.19875 debye
