program: Gaussian 09
title: 000063626
version: EM64L-G09RevD.01
frameworkgroup: C1[X(C27H16Cl2N4O3)]
method: RPBEPBE
basis: SDD
operation: Freq
keyword: #p
keyword: freq=noraman
keyword: PBEPBE/SDD
title: #p freq=noraman PBEPBE/SDD
converged: YES YES NO NO
title: Mulliken charges:
elementType: Cl Cl O O O N N N N C C C C C C C C C C C C C C C C C C C C C C C C C C C H H H H H H H H H H H H H H H H
charge: 0.007303 -0.040919 -0.221614 -0.197650 -0.195352 -0.352829 -0.035113 -0.070221 0.022703 0.016574 0.157825 0.132866 0.601999 0.059579 0.300511 -0.316870 -0.277369 -0.271758 -0.350903 -0.369869 -0.301121 -0.242818 -0.202798 -0.403200 -0.380825 -0.356377 -0.398656 0.420689 0.255425 -0.381349 0.458202 -0.358027 -0.360186 -0.214544 -0.202256 -0.103053 0.273515 0.266458 0.263969 0.265036 0.254153 0.237736 0.236821 0.312552 0.292265 0.246431 0.260041 0.224623 0.235775 0.281950 0.260373 0.260302
chargesum: 0.00000
title: Mulliken charges with hydrogens summed into heavy atoms:
elementType: Cl Cl O O O N N N N C C C C C C C C C C C C C C C C C C C C C C C C C C C
charge: 0.007303 -0.040919 -0.221614 -0.197650 -0.195352 -0.352829 -0.035113 -0.070221 0.022703 0.016574 0.157825 0.132866 0.601999 0.059579 0.300511 -0.043355 -0.277369 -0.005300 -0.086934 -0.104832 -0.046968 -0.005082 0.034023 -0.090647 -0.088560 -0.109947 -0.138615 0.420689 0.255425 -0.156726 0.458202 -0.122251 -0.078236 0.045830 0.058047 -0.103053
polarizability: 7.06681864e+02 7.76026930e+01 3.80190001e+02 -1.71609821e+01 1.85617465e+01 2.54321547e+02
1716.lowfreq: -4.3711 -0.6499 -0.0008 -0.0007 -0.0001 3.4412 11.5334 19.2893 23.5300
frequency: 11.4765 19.2289 23.5261 26.8387 35.2367 41.7139 51.4298 56.0448 63.7724 70.4161 100.5656 104.6442 116.7805 127.4590 149.8285 156.0418 168.5393 169.9864 186.2530 197.9285 220.7947 250.3469 275.3354 290.7989 294.8443 311.9865 332.4590 338.7119 349.9961 354.4483 395.0646 411.0403 413.5148 423.3502 424.8704 434.6327 456.3861 463.8495 492.4954 509.9958 511.0563 520.3430 524.6849 546.6327 549.4337 566.7411 597.8140 619.4149 622.4227 631.2488 642.2502 662.3583 679.1422 684.8530 686.8683 697.0684 709.6167 718.1261 725.3737 748.0615 783.4338 792.0328 795.1536 815.5653 823.7866 829.1197 835.8560 839.5023 844.2221 846.2870 866.0693 877.0622 898.0464 915.5738 924.3201 951.6416 962.5879 975.5942 981.1245 982.8622 983.7448 992.2966 998.6087 1004.2948 1004.5444 1009.1944 1028.5598 1060.4217 1069.2520 1096.1685 1103.6604 1104.1483 1106.5724 1119.9363 1135.3864 1165.9029 1168.6866 1177.5243 1200.7572 1208.1908 1212.6208 1232.5834 1251.3345 1252.4864 1258.8490 1286.4777 1290.9003 1303.7675 1317.8906 1344.6531 1360.0373 1363.9440 1390.9295 1391.9094 1395.9532 1402.5824 1404.2403 1420.2925 1450.8309 1458.1196 1463.3344 1475.2089 1495.2953 1526.6133 1557.0014 1563.5871 1569.3781 1587.6436 1588.7157 1596.7100 1604.4031 1613.2711 1623.0855 1626.7811 2951.1961 3130.6890 3136.0362 3138.1961 3151.5768 3152.2954 3156.8163 3162.8357 3163.8158 3166.6245 3173.0632 3173.3989 3175.8690 3176.7741 3189.2339 3193.2375
redmass: 11.0201 6.1848 6.2319 8.0353 6.8387 9.5533 8.1005 6.3821 9.1360 4.7207 8.2804 7.9874 10.0362 6.3654 7.4539 11.9020 7.7136 5.9891 4.6752 7.7555 6.9908 5.8017 7.3909 9.3863 7.0536 5.1007 5.3835 6.2838 6.9633 8.7416 6.0854 3.0057 2.9905 6.2461 6.8158 5.1987 3.7393 4.3573 7.2078 7.5243 4.0715 4.4232 4.3936 4.2226 3.6925 7.4909 7.3724 6.7149 7.1592 6.5379 6.1847 7.0670 5.1479 6.2237 6.2864 5.1638 7.6965 3.6382 5.5212 4.2556 1.6534 3.9661 3.8203 6.1727 1.4587 1.5595 4.5043 1.4315 1.7670 1.5405 3.2141 4.2118 1.4952 7.2742 1.4594 1.3553 1.3773 1.3542 1.3735 1.4636 1.3910 1.4733 3.8671 2.8844 1.3618 3.9807 2.3789 2.6253 2.8606 3.2781 2.0712 3.3997 1.6067 1.3635 1.3014 1.7231 1.1724 1.1360 1.5943 6.6868 2.3267 3.3230 1.9867 1.6768 2.2814 3.0388 1.3154 1.3270 2.8203 3.0137 4.1030 6.1762 10.5772 9.6976 3.1144 2.7738 5.8514 4.1007 2.6554 2.6701 2.9637 2.5020 2.9149 9.6541 7.1350 6.9347 7.9458 8.0199 6.6413 7.4572 6.6281 7.4246 7.9360 8.2237 1.0865 1.0900 1.0886 1.0864 1.0879 1.0901 1.0886 1.0910 1.0956 1.0955 1.0971 1.0956 1.1001 1.0974 1.0929 1.0959
irintensity: 0.2222 0.2905 0.4449 0.1892 0.3068 0.3413 0.0401 0.4023 0.3775 1.0964 0.1661 1.6828 4.9080 2.0829 1.1503 1.6812 0.2812 1.0177 6.7276 2.9565 0.8870 12.4011 0.6057 0.3024 2.0119 3.7330 11.8542 2.3176 2.2654 1.5641 3.3198 1.5939 3.1846 3.0626 16.8332 5.4932 5.4824 7.6160 3.0624 2.1045 7.5244 12.8545 1.8020 12.2805 12.8682 8.4344 0.7717 17.9227 0.5567 4.7476 9.7258 5.7648 4.4083 9.2798 18.1585 7.1435 32.1735 5.2164 9.6619 0.6223 72.7639 13.2940 1.3200 13.5987 28.4235 49.8406 11.2310 13.1735 45.5120 51.9693 52.0425 14.0180 0.9266 14.1924 19.5105 5.9936 3.6976 2.3626 2.5241 11.6180 6.8171 16.6388 51.0848 7.8972 0.6874 30.1099 12.0065 19.2206 93.2714 23.4907 40.6715 22.4096 21.8162 9.0229 19.8515 124.4778 25.2069 2.6124 8.8440 338.1051 25.7487 113.7621 8.1103 37.8748 36.2394 62.9347 11.1943 2.2338 122.2891 4.9666 18.5752 43.1980 26.6645 58.2777 11.2030 23.7349 113.0926 15.0374 12.8618 108.2095 55.3198 40.0681 172.5107 424.9063 48.7421 0.4672 148.8905 68.9722 183.8876 9.0051 5.8077 160.9509 103.1378 113.4550 41.3474 7.6436 8.4627 4.8305 3.8376 7.6006 0.3067 1.7260 4.8138 9.8301 2.5807 4.2817 29.6021 4.8174 10.1557 4.8937
temp: 298.150 k
press: 1.00000 atm
elementType: 17 17 8 8 8 7 7 7 7 6 6 6 6 6 6 6 6 6 6 6 6 6 6 6 6 6 6 6 6 6 6 6 6 6 6 6 1 1 1 1 1 1 1 1 1 1 1 1 1 1 1 1
symmnumber: 1
zpe: 958908.2 jmol-1
zpe.correction: 0.365229 hartree
zpe.thermalcorrener: 0.394994 hartree
zpe.thermalcorrenthalpy: 0.395938 hartree
zpe.thermalcorrgfe: 0.299868 hartree
zpe.sumelectzpe: -2400.759191 hartree
zpe.sumelectthermal: -2400.729426 hartree
zpe.sumelectthermalent: -2400.728482 hartree
zpe.sumelectthermalfe: -2400.824552 hartree
dipole: 0.7878 -5.7013 -2.2898
dipole: 6.1943
quadrupole: -223.2499 -243.1281 -209.2669
quadrupole: 18.2930 -4.5247 11.3961
quadrupole: 1.9650 -17.9131 15.9481 18.2930 -4.5247 11.3961
hfenergy: -2401.1244202 hartree
pointgroup: C01 [X(C27H16Cl2N4O3)]
dipole: 0.0130581 -2.0463373 1.3233963 debye
polarizability: 721.8385891|-31.1404397|352.8969038|-9.4687743|-40.2480368|266.4579189 unknown
InChI: InChI=1S/C27H16Cl2N4O3/c28-19-9-5-17(6-10-19)16-30-20-11-7-18(8-12-20)26-31-24-4-2-1-3-22(24)27(34)32(26)25-14-13-21(33(35)36)15-23(25)29/h1-16H
charge 0 multiplicity 1
52 atoms
Cl 3.041548 1.50958 -2.990822
Cl -10.331584 -1.826346 -0.094133
O  5.051724 1.343736 -0.345398
O  0.11018 5.927126 0.599609
O  0.686807 6.06678 -1.603958
N  2.988102 0.225276 -0.16754
N  2.848116 -2.102725 0.439577
N  -3.469164 -1.184399 -0.446474
N  0.638773 5.445779 -0.474451
C  2.255248 -0.969906 0.089567
C  5.068152 -1.026913 0.193843
C  4.440366 0.259996 -0.139609
C  2.348332 1.517466 -0.278555
C  4.247903 -2.155365 0.514469
C  0.773185 -0.969241 -0.042601
C  6.482414 -1.13162 0.245204
C  2.360103 2.252447 -1.489373
C  1.762118 2.098895 0.8704
C  4.86725 -3.379182 0.892302
C  0.013505 -1.711661 0.900732
C  0.096627 -0.34553 -1.127452
C  7.080415 -2.347629 0.614905
C  6.267838 -3.470894 0.941654
C  1.810207 3.540513 -1.568525
C  1.189846 3.381953 0.819847
C  -1.386338 -1.780168 0.80544
C  -1.300037 -0.437548 -1.244484
C  1.229095 4.083231 -0.40344
C  -2.068265 -1.122833 -0.262468
C  -4.302147 -1.155043 0.565558
C  -5.753133 -1.315553 0.388625
C  -6.609354 -1.25156 1.521796
C  -6.321696 -1.536619 -0.898171
C  -8.004439 -1.405799 1.384769
C  -7.711486 -1.691572 -1.050242
C  -8.533247 -1.624306 0.097163
H  7.078621 -0.247617 -0.002877
H  1.770736 1.532508 1.806333
H  4.223346 -4.231597 1.127987
H  0.545629 -2.244091 1.695099
H  0.66281 0.162619 -1.913515
H  8.171207 -2.433845 0.65319
H  6.740666 -4.416081 1.229803
H  1.817386 4.116444 -2.496847
H  0.733593 3.846663 1.696712
H  -1.954102 -2.375803 1.529193
H  -1.824236 0.012266 -2.092893
H  -3.956198 -0.983874 1.607512
H  -6.182979 -1.079222 2.517548
H  -5.652435 -1.58196 -1.762828
H  -8.665529 -1.356744 2.25426
H  -8.154479 -1.860937 -2.035841
