program: Orca
programVersion: 5.0.2
elementType: Si F O O C C C C C C C C C C C C C C C C C C C C C C C C C H H H H H H H H H H H H H H H H H H H H H H H H H H H H H
charge: 0
multiplicity: 1
keywords: wb97x-d3
keywords: def2-TZVPP
keywords: def2/J RIJCOSX
keywords: DEFGRID2
keywords: scfconv7
keywords: smallprint printgap noloewdin
keywords: NOSOSCF
formula: C25H29FO2Si
InChI: InChI=1/C25H29FO2Si/c1-4-27-21-13-15-23(16-14-21)29(2,3)18-8-9-20-12-17-24(26)25(19-20)28-22-10-6-5-7-11-22/h5-7,10-17,19H,4,8-9,18H2,1-3H3
58 atoms
Si -3.567087 1.077248 1.114405
F  2.087843 -3.62807 -0.454285
O  2.000397 2.726868 -0.581482
O  1.899657 -0.947142 -1.019983
C  -3.642479 -0.819663 1.131159
C  -3.993309 -1.504729 -0.189944
C  -1.871369 1.673395 0.558868
C  -3.85148 1.682842 2.876637
C  -4.892365 1.773861 -0.02615
C  -2.971295 -1.318548 -1.311752
C  -1.650854 2.31998 -0.654764
C  -0.74554 1.435355 1.356621
C  -1.622165 -1.930521 -1.040454
C  -0.380099 2.691915 -1.082701
C  0.525205 1.803469 0.958748
C  0.724052 2.422082 -0.277485
C  -0.466093 -1.156635 -1.08338
C  -1.495853 -3.291548 -0.769201
C  0.783722 -1.721339 -0.884897
C  -0.252349 -3.869804 -0.561898
C  0.876681 -3.081622 -0.631511
C  2.322751 3.253613 -1.862579
C  2.328614 2.202474 -2.95155
C  2.759564 -0.796108 0.032463
C  4.029592 -0.328165 -0.281111
C  2.405361 -1.047946 1.351158
C  4.949425 -0.11411 0.732948
C  3.339812 -0.830353 2.355342
C  4.612474 -0.366353 2.056541
H  -2.697133 -1.210469 1.524663
H  -4.396442 -1.097842 1.876327
H  -4.956872 -1.132547 -0.549457
H  -4.141703 -2.575646 -0.019043
H  -4.840392 1.395934 3.241794
H  -3.119149 1.266487 3.572192
H  -3.780848 2.770577 2.943575
H  -5.884235 1.432098 0.278595
H  -4.908759 2.865702 -0.001363
H  -4.755342 1.473042 -1.066903
H  -3.379456 -1.764562 -2.223889
H  -2.845417 -0.255609 -1.531384
H  -2.484302 2.539254 -1.312895
H  -0.851759 0.943821 2.318241
H  -0.277628 3.178812 -2.043278
H  1.377896 1.608666 1.597277
H  -0.527893 -0.095775 -1.29412
H  -2.375683 -3.921935 -0.731459
H  -0.156644 -4.929705 -0.362982
H  3.323322 3.670978 -1.74737
H  1.661763 4.087349 -2.118212
H  2.625356 2.667344 -3.892958
H  3.046466 1.411763 -2.732083
H  1.35171 1.744402 -3.106541
H  4.293643 -0.136983 -1.313891
H  1.41254 -1.393191 1.61107
H  5.938393 0.24787 0.482513
H  3.060751 -1.024794 3.383022
H  5.333954 -0.200865 2.845641
elementType: Si F O C H
totalener: -1510.06773296 hartree
nucrepener: 3043.32984440 hartree
electener: -4553.39757736 hartree
oneelecener: -8117.70600936 hartree
twoeener: 3564.30843200 hartree
cpcmener: -0.02407739 hartree
kineticenergy: 1503.91628650 hartree
xcener: -135.237673740658 hartree
chargesum: 0.0000000
charge: 0.486976 -0.217176 -0.330718 -0.320823 -0.262731 -0.160370 -0.125967 -0.458918 -0.440869 -0.095655 -0.169168 -0.093135 -0.038398 -0.220147 -0.306035 0.329607 -0.180559 -0.149685 0.135869 -0.199635 0.283521 0.039328 -0.272630 0.328974 -0.287485 -0.204374 -0.114142 -0.165020 -0.182784 0.080127 0.096698 0.088147 0.092217 0.101824 0.100042 0.100457 0.112745 0.113836 0.101244 0.102616 0.082664 0.140994 0.129184 0.135205 0.135320 0.141907 0.139953 0.145961 0.109990 0.090672 0.102691 0.084841 0.090430 0.157682 0.146435 0.155456 0.156477 0.156333
qa: 0.4870 -0.2172 -0.3307 -0.3208 -0.2627 -0.1604 -0.1260 -0.4589 -0.4409 -0.0957 -0.1692 -0.0931 -0.0384 -0.2201 -0.3060 0.3296 -0.1806 -0.1497 0.1359 -0.1996 0.2835 0.0393 -0.2726 0.3290 -0.2875 -0.2044 -0.1141 -0.1650 -0.1828 0.0801 0.0967 0.0881 0.0922 0.1018 0.1000 0.1005 0.1127 0.1138 0.1012 0.1026 0.0827 0.1410 0.1292 0.1352 0.1353 0.1419 0.1400 0.1460 0.1100 0.0907 0.1027 0.0848 0.0904 0.1577 0.1464 0.1555 0.1565 0.1563
va: 4.0934 1.0694 2.0628 2.0450 3.8342 3.9007 3.6544 3.9041 3.9107 3.7931 3.8631 3.8374 3.6938 3.8540 4.0079 3.7142 3.8706 3.8660 3.7575 3.9523 3.9573 3.8450 3.9161 3.5348 3.9832 3.8587 3.9015 3.9157 3.9090 1.0161 1.0055 1.0008 1.0023 1.0108 1.0114 1.0104 1.0077 1.0091 1.0072 1.0044 1.0141 0.9904 0.9962 1.0062 1.0075 0.9847 1.0024 1.0006 0.9929 0.9978 1.0133 1.0067 1.0011 0.9983 1.0088 0.9899 0.9907 0.9899
dispcorr: -0.036571384 hartree
energy: -1510.104304341731
dipole: -23.24843 22.14183 -1.10660 16.53756 -16.23174 0.30582 0.35129 -0.83791 -0.48662
magnitude: 1.24695 au
magnitude: 3.16949 debye
