program: Gaussian 09
title: 000063565
version: EM64L-G09RevD.01
frameworkgroup: C1[X(C16H16N4O)]
method: RPBEPBE
basis: SDD
operation: Freq
keyword: #p
keyword: freq=noraman
keyword: PBEPBE/SDD
title: #p freq=noraman PBEPBE/SDD
converged: YES YES NO NO
title: Mulliken charges:
elementType: O N N N N C C C C C C C C C C C C C C C C H H H H H H H H H H H H H H H H
charge: -0.298715 -0.145649 -0.333409 -0.449194 -0.027315 -0.374993 0.136906 0.227136 -0.335839 0.066539 -0.256927 -0.322714 -0.327152 0.442727 -0.236510 -0.202855 -0.374712 -0.425313 -0.219902 -0.193201 -0.280068 0.278798 0.210341 0.285126 0.209938 0.209511 0.240528 0.383916 0.272413 0.262281 0.236982 0.236774 0.222789 0.233010 0.212891 0.215439 0.220426
chargesum: 0.00000
title: Mulliken charges with hydrogens summed into heavy atoms:
elementType: O N N N N C C C C C C C C C C C C C C C C
charge: -0.298715 -0.145649 -0.048283 -0.065278 -0.027315 0.114145 0.136906 0.227136 0.083611 0.066539 -0.016399 -0.050301 -0.064871 0.442727 0.000472 0.033920 -0.151923 -0.192304 -0.007011 0.022237 -0.059643
polarizability: 3.12405923e+02 6.12546190e+00 2.21727493e+02 1.17154558e+01 -1.20632761e+00 1.01444742e+02
1716.lowfreq: -8.5396 -2.8466 -0.0006 0.0004 0.0009 6.7317 15.7827 33.0038 42.4373
frequency: 15.6380 32.9696 42.4036 54.3912 79.2099 104.5512 138.1330 144.2580 184.0570 211.4976 233.4341 240.6991 260.7433 313.5439 333.0188 382.0680 409.2289 410.8120 425.7544 458.8589 487.9093 498.4719 508.7348 530.4129 537.0456 586.4936 597.2404 611.3902 615.7026 676.2220 682.0897 692.6592 700.0869 753.4633 764.1063 785.4416 797.3676 817.7788 835.5872 851.1643 869.1069 892.2756 906.4055 933.4265 941.6810 952.8943 971.6154 976.2209 981.4596 988.3625 1005.2002 1022.8112 1023.8785 1076.7780 1089.7161 1096.1485 1129.0638 1131.4337 1160.8949 1167.8272 1183.9616 1188.4651 1196.7683 1227.1515 1235.1939 1259.0705 1282.2507 1297.2043 1330.7429 1342.9964 1370.7375 1373.9558 1382.6269 1397.4230 1407.0544 1441.6083 1448.6127 1455.7309 1458.2793 1476.7061 1493.2886 1505.4882 1529.6720 1551.9148 1562.5843 1587.1897 1605.3908 1618.6254 1627.8694 2859.7706 2926.5601 2946.2733 3074.4528 3114.6642 3119.1405 3130.4903 3136.6514 3137.9812 3144.7338 3152.1561 3162.5613 3166.9420 3176.5597 3377.2976 3581.6673
redmass: 5.4907 4.6910 4.8728 5.3883 4.5289 3.9899 5.5433 4.6508 4.1167 3.4724 4.5466 5.2166 2.2051 5.2191 2.3204 4.1551 2.7777 2.7188 3.0445 3.8144 4.2518 5.0589 2.7293 4.3929 6.9107 5.6742 3.4566 5.6536 5.4005 1.3765 3.3535 1.8381 3.9827 1.8137 5.8204 1.5134 3.6232 1.2602 4.5159 5.2032 1.5463 1.4429 1.4923 4.9509 3.4257 1.3605 1.3020 5.6342 1.3743 1.9644 1.3373 2.1656 2.1000 1.8462 2.7700 1.7950 2.9611 2.6117 1.3637 1.0482 1.9462 1.1112 2.7083 1.6117 2.5161 1.4108 1.7914 1.7300 1.5327 1.7534 1.3307 2.0391 2.3295 2.2561 1.8164 2.5071 2.2254 1.6050 1.9272 1.2894 2.1570 1.1154 1.8979 6.5085 6.8871 4.8008 6.3859 6.7503 6.1768 1.0699 1.0900 1.0691 1.0936 1.0842 1.0872 1.0920 1.0931 1.0863 1.0944 1.0902 1.1010 1.0957 1.0998 1.0814 1.0773
irintensity: 0.3196 0.8573 0.1550 0.3714 4.6574 5.0702 2.6902 0.0648 2.2501 8.4236 0.2589 2.2139 26.6364 7.9079 67.7608 13.9218 13.9372 13.6618 8.5137 14.8438 7.3966 17.5630 18.7510 8.5228 13.5130 3.3996 1.2169 13.1432 9.8054 76.8058 40.4888 64.7838 50.9834 82.9027 48.6267 78.0828 2.0218 4.4587 3.3257 22.5436 14.4629 3.8649 11.2408 4.8070 19.4431 0.1002 1.1155 7.1859 3.2704 33.9807 0.0101 5.3705 23.1628 9.7673 41.9777 19.8236 98.9180 9.8780 18.0628 1.9053 30.8745 7.0142 96.5181 26.0667 25.2518 34.6838 11.2684 20.1484 81.8489 39.8015 1.5514 20.3058 20.9934 27.6715 14.8046 27.2587 9.4464 28.7607 32.1749 26.8423 27.2073 90.8650 396.0766 70.9847 40.4624 141.7660 464.8017 21.9058 136.1766 105.8285 91.0743 75.0521 1.5466 16.4055 3.6995 10.6557 27.0494 4.2273 48.9001 6.3940 21.4206 9.4640 21.3566 788.0004 8.6802
temp: 298.150 k
press: 1.00000 atm
elementType: 8 7 7 7 7 6 6 6 6 6 6 6 6 6 6 6 6 6 6 6 6 1 1 1 1 1 1 1 1 1 1 1 1 1 1 1 1
symmnumber: 1
zpe: 772598.0 jmol-1
zpe.correction: 0.294267 hartree
zpe.thermalcorrener: 0.311943 hartree
zpe.thermalcorrenthalpy: 0.312888 hartree
zpe.thermalcorrgfe: 0.246535 hartree
zpe.sumelectzpe: -912.057437 hartree
zpe.sumelectthermal: -912.039760 hartree
zpe.sumelectthermalent: -912.038816 hartree
zpe.sumelectthermalfe: -912.105169 hartree
dipole: 3.2690 -2.5339 0.2873
dipole: 4.1460
quadrupole: -126.3527 -105.1063 -126.4863
quadrupole: 14.0510 2.0487 -1.6713
quadrupole: -7.0376 14.2088 -7.1712 14.0510 2.0487 -1.6713
hfenergy: -912.3517038 hartree
pointgroup: C01 [X(C16H16N4O1)]
dipole: 1.2709264 -1.0203171 0.0664483 debye
polarizability: 312.8414978|4.3447821|221.5297071|9.1871277|2.1693728|101.2069535 unknown
InChI: InChI=1S/C16H16N4O/c21-16-14-8-4-5-9-15(14)19-12-20(16)11-17-10-18-13-6-2-1-3-7-13/h1-9,12,17-18H,10-11H2
charge 0 multiplicity 1
37 atoms
O  0.268011 0.691998 -0.079255
N  1.261722 -1.390063 -0.530875
N  -0.749169 -2.22835 0.59967
N  -2.329158 -0.429899 0.523284
N  3.660678 -1.715251 -0.549015
C  -0.085612 -2.053405 -0.668295
C  2.692921 0.518154 -0.036835
C  1.324897 -0.003994 -0.201508
C  -2.156984 -1.855953 0.774026
C  3.818544 -0.353159 -0.216313
C  2.424166 -2.153001 -0.685855
C  2.896174 1.88414 0.293929
C  5.133319 0.164553 -0.057319
C  -3.55987 0.16623 0.254425
C  4.200226 2.380671 0.448117
C  5.319365 1.516956 0.271595
C  -4.796062 -0.537745 0.389592
C  -3.599476 1.53358 -0.164301
C  -6.01831 0.106749 0.096133
C  -4.826707 2.161552 -0.443002
C  -6.050962 1.455707 -0.322176
H  -0.715111 -1.406359 -1.302292
H  0.118413 -2.999624 -1.213917
H  -0.376666 -2.927021 1.24054
H  -2.840423 -2.422295 0.094174
H  -2.431654 -2.146069 1.813151
H  2.261567 -3.205253 -0.946932
H  -1.462079 0.123111 0.452194
H  2.017194 2.523878 0.422395
H  5.976278 -0.518059 -0.199347
H  4.359751 3.433119 0.704618
H  6.333725 1.912275 0.393187
H  -4.808977 -1.574312 0.743377
H  -2.65709 2.084978 -0.269068
H  -6.955227 -0.452764 0.206966
H  -4.830245 3.210711 -0.762361
H  -7.003273 1.949217 -0.542609
