program: Orca
programVersion: 5.0.2
elementType: Si F O O C C C C C C C C C C C C C C C C C C C C C C C C C H H H H H H H H H H H H H H H H H H H H H H H H H H H H H
charge: 0
multiplicity: 1
keywords: wb97x-d3
keywords: def2-TZVPP
keywords: def2/J RIJCOSX
keywords: DEFGRID2
keywords: scfconv7
keywords: smallprint printgap noloewdin
keywords: NOSOSCF
formula: C25H29FO2Si
InChI: InChI=1/C25H29FO2Si/c1-4-27-21-13-15-23(16-14-21)29(2,3)18-8-9-20-12-17-24(26)25(19-20)28-22-10-6-5-7-11-22/h5-7,10-17,19H,4,8-9,18H2,1-3H3
58 atoms
Si -4.01344 1.042759 0.843969
F  2.025009 -1.828981 1.182162
O  1.888194 2.403177 0.819227
O  1.654982 -0.244108 -1.025025
C  -4.13938 -0.694884 0.117199
C  -3.645711 -0.782305 -1.334286
C  -2.184989 1.492529 0.873011
C  -4.691694 1.046677 2.599624
C  -4.949791 2.270503 -0.230042
C  -2.835486 -2.048553 -1.636476
C  -1.605144 2.351104 -0.067142
C  -1.325731 0.935661 1.82056
C  -1.521284 -2.051646 -0.905186
C  -0.251457 2.638779 -0.060943
C  0.035699 1.211475 1.85017
C  0.584754 2.072553 0.901931
C  -0.49433 -1.20578 -1.324852
C  -1.311659 -2.834031 0.224862
C  0.699938 -1.134669 -0.632048
C  -0.117002 -2.770872 0.933401
C  0.871564 -1.916991 0.503274
C  2.820143 1.884176 1.760828
C  2.798049 2.626292 3.080174
C  2.873725 -0.686119 -1.456209
C  3.1322 -2.004204 -1.808126
C  3.86762 0.280869 -1.558777
C  4.404845 -2.350274 -2.244821
C  5.129574 -0.080972 -2.000809
C  5.409192 -1.398868 -2.340103
H  -3.541832 -1.342483 0.76886
H  -5.161881 -1.076408 0.19364
H  -3.020773 0.078286 -1.598105
H  -4.500154 -0.735821 -2.013163
H  -4.598632 2.028425 3.068707
H  -5.750399 0.777134 2.613785
H  -4.170744 0.32955 3.237945
H  -4.858289 3.293191 0.141648
H  -4.603869 2.266285 -1.265902
H  -6.015027 2.028048 -0.248705
H  -3.416723 -2.932894 -1.363951
H  -2.655119 -2.109035 -2.712999
H  -2.218851 2.815579 -0.830887
H  -1.713073 0.258473 2.574635
H  0.169689 3.304774 -0.804831
H  0.642453 0.747679 2.616094
H  -0.621884 -0.581214 -2.201868
H  -2.089233 -3.505705 0.566667
H  0.038563 -3.374023 1.818803
H  3.794543 2.006438 1.287182
H  2.672971 0.810104 1.903684
H  2.998942 3.688507 2.93597
H  1.848158 2.527635 3.606024
H  3.576977 2.226192 3.730904
H  2.361414 -2.76299 -1.756916
H  3.64691 1.308185 -1.296861
H  4.605606 -3.379808 -2.512476
H  5.900422 0.675351 -2.076173
H  6.398525 -1.679211 -2.676663
elementType: Si F O C H
totalener: -1510.06833828 hartree
nucrepener: 3032.41734086 hartree
electener: -4542.48567913 hartree
oneelecener: -8096.24621163 hartree
twoeener: 3553.76053249 hartree
cpcmener: -0.02352689 hartree
kineticenergy: 1503.90747622 hartree
xcener: -135.232655413801 hartree
chargesum: -0.0000000
charge: 0.482089 -0.224094 -0.340801 -0.313110 -0.273164 -0.120783 -0.109461 -0.444227 -0.428736 -0.100723 -0.120509 -0.244810 0.076739 -0.265641 -0.166103 0.314764 -0.263359 -0.193600 0.161637 -0.149261 0.245950 0.053847 -0.265727 0.318448 -0.202207 -0.278803 -0.159361 -0.120951 -0.190905 0.076774 0.095146 0.064622 0.094317 0.103352 0.102265 0.099283 0.109378 0.100227 0.107135 0.087110 0.095988 0.140626 0.131246 0.130622 0.137292 0.130914 0.145175 0.145561 0.103453 0.078742 0.089072 0.091167 0.094561 0.150525 0.149164 0.157038 0.156175 0.155933
qa: 0.4821 -0.2241 -0.3408 -0.3131 -0.2732 -0.1208 -0.1095 -0.4442 -0.4287 -0.1007 -0.1205 -0.2448 0.0767 -0.2656 -0.1661 0.3148 -0.2634 -0.1936 0.1616 -0.1493 0.2459 0.0538 -0.2657 0.3184 -0.2022 -0.2788 -0.1594 -0.1210 -0.1909 0.0768 0.0951 0.0646 0.0943 0.1034 0.1023 0.0993 0.1094 0.1002 0.1071 0.0871 0.0960 0.1406 0.1312 0.1306 0.1373 0.1309 0.1452 0.1456 0.1035 0.0787 0.0891 0.0912 0.0946 0.1505 0.1492 0.1570 0.1562 0.1559
va: 4.1433 1.0526 2.0386 2.0258 3.8301 3.8715 3.6614 3.9054 3.9084 3.8599 3.8519 3.9417 3.5674 4.0376 3.7875 3.6769 3.9946 3.8922 3.5892 3.9300 3.9043 3.8253 3.9586 3.6903 3.9064 3.9653 3.9191 3.9106 3.9146 1.0175 1.0114 1.0068 1.0082 1.0095 1.0106 1.0113 1.0073 1.0087 1.0091 1.0067 1.0063 0.9871 0.9967 1.0141 1.0039 1.0196 1.0004 1.0005 0.9895 1.0057 1.0050 1.0024 1.0072 1.0040 1.0146 0.9911 0.9914 0.9909
dispcorr: -0.035722401 hartree
energy: -1510.104060676232
dipole: -20.92316 20.41252 -0.51064 8.94586 -9.86384 -0.91798 5.09361 -4.89745 0.19617
magnitude: 1.06861 au
magnitude: 2.71618 debye
