program: Orca
programVersion: 5.0.2
elementType: Si F O O C C C C C C C C C C C C C C C C C C C C C C C C C H H H H H H H H H H H H H H H H H H H H H H H H H H H H H
charge: 0
multiplicity: 1
keywords: wb97x-d3
keywords: def2-TZVPP
keywords: def2/J RIJCOSX
keywords: DEFGRID2
keywords: scfconv7
keywords: smallprint printgap noloewdin
keywords: NOSOSCF
formula: C25H29FO2Si
InChI: InChI=1/C25H29FO2Si/c1-4-27-21-13-15-23(16-14-21)29(2,3)18-8-9-20-12-17-24(26)25(19-20)28-22-10-6-5-7-11-22/h5-7,10-17,19H,4,8-9,18H2,1-3H3
58 atoms
Si -2.913027 1.531714 -0.559521
F  3.139869 -1.899934 0.860732
O  1.176425 1.421971 3.893692
O  2.338424 -2.005555 -1.685791
C  -2.423574 0.211867 -1.827597
C  -2.839826 -1.234573 -1.545222
C  -1.694795 1.528619 0.874128
C  -4.661293 1.239685 0.073371
C  -2.804628 3.21007 -1.411983
C  -2.387211 -1.827712 -0.212776
C  -2.070842 1.286039 2.192096
C  -0.331741 1.75329 0.639002
C  -0.903488 -1.853672 0.051512
C  -1.149677 1.248457 3.235036
C  0.602486 1.721948 1.655791
C  0.1999 1.458103 2.967929
C  0.028887 -1.908779 -0.978679
C  -0.437271 -1.849331 1.365189
C  1.391133 -1.921328 -0.709189
C  0.918806 -1.87835 1.648457
C  1.822639 -1.898368 0.607192
C  0.843454 1.118838 5.241155
C  2.118018 1.124433 6.048082
C  2.219276 -1.236584 -2.811843
C  1.732093 0.064584 -2.7789
C  2.656735 -1.798789 -4.002941
C  1.675436 0.795396 -3.957229
C  2.604443 -1.051494 -5.170739
C  2.107393 0.244474 -5.156251
H  -2.862534 0.510411 -2.786388
H  -1.340992 0.280308 -1.983984
H  -2.496306 -1.875915 -2.36323
H  -3.930978 -1.30134 -1.57025
H  -4.763335 0.291853 0.605788
H  -4.985348 2.032456 0.751042
H  -5.37138 1.2199 -0.756811
H  -1.807115 3.388909 -1.820258
H  -3.511164 3.288061 -2.241639
H  -3.021894 4.026212 -0.719568
H  -2.870252 -1.295909 0.611812
H  -2.768301 -2.852797 -0.152695
H  -3.112598 1.110049 2.436249
H  0.02138 1.951951 -0.368068
H  -1.50344 1.04902 4.237828
H  1.652142 1.888273 1.444182
H  -0.297619 -1.938649 -2.011291
H  -1.144045 -1.81166 2.18458
H  1.274994 -1.86143 2.67074
H  0.35818 0.138345 5.299583
H  0.140367 1.860377 5.635463
H  1.888628 0.894289 7.088634
H  2.823877 0.374535 5.689065
H  2.604723 2.099966 6.022171
H  1.402588 0.512084 -1.849094
H  3.036421 -2.812901 -4.012688
H  1.29373 1.808066 -3.931619
H  2.946358 -1.492867 -6.098112
H  2.059557 0.821322 -6.070402
elementType: Si F O C H
totalener: -1510.06842961 hartree
nucrepener: 2983.37593573 hartree
electener: -4493.44436533 hartree
oneelecener: -7997.22009963 hartree
twoeener: 3503.77573429 hartree
cpcmener: -0.02507344 hartree
kineticenergy: 1503.89616625 hartree
xcener: -135.233297929050 hartree
chargesum: -0.0000000
charge: 0.471423 -0.218967 -0.325903 -0.332036 -0.227816 -0.151344 -0.108723 -0.438516 -0.451213 -0.080036 -0.152228 -0.115005 0.036797 -0.241716 -0.331074 0.366646 -0.223488 -0.212081 0.206194 -0.180901 0.204076 0.059017 -0.273177 0.276389 -0.179084 -0.232809 -0.170074 -0.131618 -0.170764 0.096081 0.045141 0.084609 0.090638 0.104699 0.111181 0.112419 0.100154 0.100772 0.101002 0.077649 0.099932 0.141390 0.140925 0.134762 0.128221 0.153485 0.138403 0.141183 0.092572 0.095757 0.088716 0.087249 0.087326 0.158202 0.144920 0.156181 0.157025 0.157440
qa: 0.4714 -0.2190 -0.3259 -0.3320 -0.2278 -0.1513 -0.1087 -0.4385 -0.4512 -0.0800 -0.1522 -0.1150 0.0368 -0.2417 -0.3311 0.3666 -0.2235 -0.2121 0.2062 -0.1809 0.2041 0.0590 -0.2732 0.2764 -0.1791 -0.2328 -0.1701 -0.1316 -0.1708 0.0961 0.0451 0.0846 0.0906 0.1047 0.1112 0.1124 0.1002 0.1008 0.1010 0.0776 0.0999 0.1414 0.1409 0.1348 0.1282 0.1535 0.1384 0.1412 0.0926 0.0958 0.0887 0.0872 0.0873 0.1582 0.1449 0.1562 0.1570 0.1574
va: 4.1108 1.0685 2.0670 2.0864 3.8487 3.9065 3.6567 3.9135 3.9037 3.8213 3.8582 3.8199 3.6430 3.8543 4.0051 3.6779 3.8905 3.8607 3.6829 3.8418 4.0612 3.7972 3.9752 3.7172 3.8575 3.9894 3.9114 3.8931 3.8955 1.0120 1.0223 1.0011 0.9981 1.0069 1.0088 1.0090 1.0106 1.0114 1.0097 1.0084 1.0024 0.9897 0.9820 1.0130 1.0167 0.9949 1.0020 1.0027 0.9854 0.9873 1.0058 1.0033 1.0035 0.9904 1.0079 0.9934 0.9892 0.9902
dispcorr: -0.034494613 hartree
energy: -1510.102924218739
dipole: -25.48581 23.74628 -1.73954 13.68643 -13.52667 0.15975 5.20484 -4.79247 0.41238
magnitude: 1.79487 au
magnitude: 4.56220 debye
