program: Orca
programVersion: 5.0.2
elementType: Si F O O C C C C C C C C C C C C C C C C C C C C C C C C C H H H H H H H H H H H H H H H H H H H H H H H H H H H H H
charge: 0
multiplicity: 1
keywords: wb97x-d3
keywords: def2-TZVPP
keywords: def2/J RIJCOSX
keywords: DEFGRID2
keywords: scfconv7
keywords: smallprint printgap noloewdin
keywords: NOSOSCF
formula: C25H29FO2Si
InChI: InChI=1/C25H29FO2Si/c1-4-27-21-13-15-23(16-14-21)29(2,3)18-8-9-20-12-17-24(26)25(19-20)28-22-10-6-5-7-11-22/h5-7,10-17,19H,4,8-9,18H2,1-3H3
58 atoms
Si -2.768833 1.626726 -0.527322
F  3.141308 -2.017715 0.852889
O  1.292452 1.265655 3.941924
O  2.336331 -2.068481 -1.687585
C  -2.335105 0.291427 -1.798607
C  -2.813791 -1.137708 -1.529287
C  -1.559065 1.565322 0.912273
C  -4.529643 1.411733 0.100912
C  -2.58274 3.296745 -1.382414
C  -2.382714 -1.763676 -0.204619
C  -1.955453 1.336028 2.227043
C  -0.185178 1.723487 0.689507
C  -0.900537 -1.846454 0.056479
C  -1.046114 1.245897 3.276493
C  0.738078 1.636993 1.71358
C  0.315496 1.382452 3.021299
C  0.027153 -1.919257 -0.977471
C  -0.43178 -1.871754 1.368621
C  1.389234 -1.971811 -0.712537
C  0.92385 -1.944189 1.647236
C  1.823798 -1.977405 0.603571
C  0.967553 1.042255 5.308291
C  0.541314 2.304227 6.027593
C  2.210866 -1.33332 -2.835225
C  1.722572 -0.032124 -2.839682
C  2.644427 -1.930354 -4.010552
C  1.655894 0.661051 -4.039921
C  2.583303 -1.220075 -5.200774
C  2.081362 0.073813 -5.223987
H  -2.756559 0.615497 -2.757026
H  -1.250088 0.313862 -1.950806
H  -2.501235 -1.785095 -2.354926
H  -3.906923 -1.15645 -1.550993
H  -5.23961 1.429634 -0.729288
H  -4.674986 0.466669 0.628108
H  -4.817015 2.214665 0.783205
H  -3.276542 3.399995 -2.220005
H  -2.773058 4.12467 -0.696109
H  -1.574438 3.432295 -1.780913
H  -2.844386 -1.223451 0.626831
H  -2.802374 -2.774203 -0.156762
H  -3.006438 1.213666 2.464275
H  0.186841 1.90734 -0.313631
H  -1.422371 1.061678 4.273895
H  1.796417 1.748171 1.509141
H  -0.304643 -1.929745 -2.008599
H  -1.134658 -1.821044 2.19071
H  1.282906 -1.94896 2.668578
H  1.884768 0.655614 5.753393
H  0.213895 0.254655 5.404934
H  -0.382445 2.726538 5.631234
H  0.374125 2.078733 7.081818
H  1.317457 3.068401 5.971088
H  1.39794 0.44394 -1.922391
H  3.027952 -2.942831 -3.990924
H  1.269104 1.672078 -4.043602
H  2.922986 -1.688676 -6.115503
H  2.024188 0.620984 -6.155683
elementType: Si F O C H
totalener: -1510.06591987 hartree
nucrepener: 2986.79218569 hartree
electener: -4496.85810556 hartree
oneelecener: -8004.08952133 hartree
twoeener: 3507.23141578 hartree
cpcmener: -0.02525084 hartree
kineticenergy: 1503.89459147 hartree
xcener: -135.234676327317 hartree
chargesum: 0.0000000
charge: 0.473388 -0.219306 -0.337296 -0.330965 -0.227180 -0.149170 -0.110835 -0.438433 -0.450983 -0.082790 -0.165931 -0.113102 0.039083 -0.223002 -0.336984 0.363866 -0.232489 -0.215868 0.217205 -0.175571 0.198943 0.048995 -0.262204 0.279255 -0.181547 -0.232861 -0.170949 -0.132255 -0.170098 0.095748 0.042307 0.084458 0.090190 0.112439 0.104445 0.110869 0.100761 0.100949 0.100339 0.079221 0.099620 0.141192 0.141571 0.137486 0.127901 0.153312 0.137230 0.141155 0.108115 0.082525 0.090276 0.092890 0.088419 0.159607 0.144990 0.156167 0.157318 0.157584
qa: 0.4734 -0.2193 -0.3373 -0.3310 -0.2272 -0.1492 -0.1108 -0.4384 -0.4510 -0.0828 -0.1659 -0.1131 0.0391 -0.2230 -0.3370 0.3639 -0.2325 -0.2159 0.2172 -0.1756 0.1989 0.0490 -0.2622 0.2793 -0.1815 -0.2329 -0.1709 -0.1323 -0.1701 0.0957 0.0423 0.0845 0.0902 0.1124 0.1044 0.1109 0.1008 0.1009 0.1003 0.0792 0.0996 0.1412 0.1416 0.1375 0.1279 0.1533 0.1372 0.1412 0.1081 0.0825 0.0903 0.0929 0.0884 0.1596 0.1450 0.1562 0.1573 0.1576
va: 4.1119 1.0676 2.0587 2.0890 3.8495 3.9060 3.6615 3.9144 3.9040 3.8237 3.8513 3.8245 3.6407 3.8427 4.0152 3.6645 3.8873 3.8628 3.6774 3.8398 4.0582 3.8564 3.9210 3.7180 3.8646 3.9898 3.9116 3.8932 3.8961 1.0119 1.0234 1.0010 0.9982 1.0092 1.0069 1.0088 1.0113 1.0097 1.0106 1.0074 1.0024 0.9897 0.9822 1.0065 1.0169 0.9942 1.0023 1.0035 0.9925 0.9970 1.0024 1.0089 1.0055 0.9876 1.0080 0.9934 0.9891 0.9902
dispcorr: -0.034871723 hartree
energy: -1510.100791594656
dipole: -27.97573 26.19202 -1.78371 17.00195 -16.72196 0.28000 5.25065 -4.81286 0.43779
magnitude: 1.85787 au
magnitude: 4.72233 debye
