program: Orca
programVersion: 5.0.2
elementType: Si F O O C C C C C C C C C C C C C C C C C C C C C C C C C H H H H H H H H H H H H H H H H H H H H H H H H H H H H H
charge: 0
multiplicity: 1
keywords: wb97x-d3
keywords: def2-TZVPP
keywords: def2/J RIJCOSX
keywords: DEFGRID2
keywords: scfconv7
keywords: smallprint printgap noloewdin
keywords: NOSOSCF
formula: C25H29FO2Si
InChI: InChI=1/C25H29FO2Si/c1-4-27-21-13-15-23(16-14-21)29(2,3)18-8-9-20-12-17-24(26)25(19-20)28-22-10-6-5-7-11-22/h5-7,10-17,19H,4,8-9,18H2,1-3H3
58 atoms
Si -3.240655 0.247416 -0.002555
F  3.47225 -0.341385 0.270124
O  1.18071 1.464339 3.950178
O  2.528405 -1.573299 -1.913116
C  -2.428927 0.537405 -1.682887
C  -1.96566 1.986914 -1.88365
C  -1.934749 0.629066 1.299822
C  -3.784356 -1.547827 0.150237
C  -4.70517 1.409787 0.212188
C  -0.647775 2.118595 -2.657443
C  -0.95823 -0.309467 1.653949
C  -1.831457 1.887298 1.891667
C  0.496565 1.491529 -1.91045
C  0.064296 -0.008109 2.534848
C  -0.812657 2.215938 2.779133
C  0.151617 1.264846 3.102961
C  0.994226 0.248754 -2.285533
C  1.038656 2.112884 -0.785184
C  1.993746 -0.371708 -1.54934
C  2.048466 1.510711 -0.051059
C  2.508338 0.266863 -0.434567
C  1.410204 2.755622 4.500498
C  2.053556 3.711593 3.518176
C  1.715072 -2.666073 -2.031934
C  2.166753 -3.678878 -2.868539
C  0.518371 -2.801947 -1.339279
C  1.413863 -4.833866 -3.011368
C  -0.22785 -3.962242 -1.499445
C  0.210809 -4.980855 -2.332927
H  -1.579911 -0.153508 -1.737174
H  -3.09668 0.236108 -2.495678
H  -1.834749 2.501341 -0.925723
H  -2.74141 2.547998 -2.40981
H  -2.952934 -2.241316 0.004454
H  -4.218319 -1.758499 1.129834
H  -4.539242 -1.792856 -0.600473
H  -5.163948 1.314508 1.198431
H  -4.422326 2.456862 0.0836
H  -5.47827 1.19569 -0.529438
H  -0.749037 1.653899 -3.641388
H  -0.439995 3.178253 -2.828051
H  -0.988239 -1.310535 1.237263
H  -2.561763 2.655621 1.663128
H  0.807542 -0.754803 2.788632
H  -0.791505 3.212782 3.198766
H  0.598424 -0.250699 -3.162531
H  0.670924 3.083256 -0.473935
H  2.469256 1.995709 0.820707
H  2.0822 2.584451 5.34173
H  0.48725 3.172644 4.915021
H  3.005739 3.32109 3.157355
H  1.419988 3.924442 2.656843
H  2.253088 4.659835 4.019675
H  3.103153 -3.55994 -3.399533
H  0.165553 -2.022172 -0.675944
H  1.769793 -5.620437 -3.66439
H  -1.160839 -4.066164 -0.959711
H  -0.377909 -5.880937 -2.451674
elementType: Si F O C H
totalener: -1510.06682219 hartree
nucrepener: 2997.00448340 hartree
electener: -4507.07130559 hartree
oneelecener: -8024.40448802 hartree
twoeener: 3517.33318243 hartree
cpcmener: -0.02545169 hartree
kineticenergy: 1503.90256224 hartree
xcener: -135.232394394788 hartree
chargesum: 0.0000000
charge: 0.458583 -0.218066 -0.331118 -0.332765 -0.232840 -0.133357 -0.136897 -0.422326 -0.429769 -0.096794 -0.106422 -0.150296 0.091320 -0.303420 -0.238764 0.341062 -0.230999 -0.270568 0.215983 -0.165263 0.202979 0.050956 -0.278343 0.253347 -0.218398 -0.141216 -0.139875 -0.188123 -0.165176 0.057144 0.095946 0.068084 0.092635 0.083721 0.106031 0.103851 0.108424 0.099852 0.106196 0.084546 0.095197 0.137749 0.143628 0.126894 0.136366 0.148130 0.141840 0.150406 0.108293 0.084134 0.090590 0.089313 0.102682 0.144552 0.134105 0.157081 0.162152 0.157026
qa: 0.4586 -0.2181 -0.3311 -0.3328 -0.2328 -0.1334 -0.1369 -0.4223 -0.4298 -0.0968 -0.1064 -0.1503 0.0913 -0.3034 -0.2388 0.3411 -0.2310 -0.2706 0.2160 -0.1653 0.2030 0.0510 -0.2783 0.2533 -0.2184 -0.1412 -0.1399 -0.1881 -0.1652 0.0571 0.0959 0.0681 0.0926 0.0837 0.1060 0.1039 0.1084 0.0999 0.1062 0.0845 0.0952 0.1377 0.1436 0.1269 0.1364 0.1481 0.1418 0.1504 0.1083 0.0841 0.0906 0.0893 0.1027 0.1446 0.1341 0.1571 0.1622 0.1570
va: 4.1558 1.0687 2.0683 2.0835 3.8246 3.8970 3.6871 3.9116 3.9118 3.8589 3.8450 3.8585 3.5804 4.0079 3.8753 3.6872 3.9410 3.8733 3.6414 3.7875 4.0935 3.8540 3.9128 3.7538 3.9638 3.8375 3.9142 3.9219 3.8958 1.0179 1.0120 1.0058 1.0094 1.0152 1.0103 1.0115 1.0083 1.0096 1.0092 1.0089 1.0056 0.9762 0.9870 1.0180 1.0073 1.0053 1.0040 0.9949 0.9923 0.9961 1.0039 1.0011 1.0119 1.0089 0.9996 0.9890 0.9896 0.9911
dispcorr: -0.035246560 hartree
energy: -1510.102068751591
dipole: -25.97822 24.70850 -1.26972 13.63932 -12.27819 1.36113 2.94655 -3.09861 -0.15205
magnitude: 1.86761 au
magnitude: 4.74710 debye
