program: Orca
programVersion: 5.0.2
elementType: Si F O O C C C C C C C C C C C C C C C C C C C C C C C C C H H H H H H H H H H H H H H H H H H H H H H H H H H H H H
charge: 0
multiplicity: 1
keywords: wb97x-d3
keywords: def2-TZVPP
keywords: def2/J RIJCOSX
keywords: DEFGRID2
keywords: scfconv7
keywords: smallprint printgap noloewdin
keywords: NOSOSCF
formula: C25H29FO2Si
InChI: InChI=1/C25H29FO2Si/c1-4-27-21-13-15-23(16-14-21)29(2,3)18-8-9-20-12-17-24(26)25(19-20)28-22-10-6-5-7-11-22/h5-7,10-17,19H,4,8-9,18H2,1-3H3
58 atoms
Si -3.548886 1.259778 0.743783
F  1.027008 -4.703332 1.059164
O  2.213342 3.104028 0.757794
O  1.646011 -2.176273 0.520325
C  -3.473423 -0.413389 -0.130793
C  -2.853297 -0.336565 -1.52493
C  -1.786808 1.921722 0.790362
C  -4.194982 1.016411 2.495168
C  -4.64712 2.456415 -0.205389
C  -2.501497 -1.69833 -2.127491
C  -1.395559 3.065107 0.09843
C  -0.77973 1.224097 1.470619
C  -1.552831 -2.508354 -1.283324
C  -0.074866 3.50228 0.063857
C  0.538147 1.639545 1.455326
C  0.90609 2.781694 0.738949
C  -0.371311 -1.944646 -0.803097
C  -1.842776 -3.82731 -0.951031
C  0.506162 -2.683301 -0.024638
C  -0.979163 -4.574675 -0.162103
C  0.185534 -3.99762 0.290661
C  2.649107 4.248278 0.034828
C  4.146267 4.358272 0.180766
C  2.486913 -1.374092 -0.200703
C  3.275665 -0.501146 0.538233
C  2.611329 -1.437941 -1.582961
C  4.180462 0.323718 -0.111382
C  3.517079 -0.599764 -2.219614
C  4.302029 0.28488 -1.493983
H  -2.886472 -1.083678 0.507759
H  -4.47285 -0.8589 -0.183913
H  -1.952293 0.283998 -1.503901
H  -3.540005 0.171267 -2.207683
H  -4.254539 1.960571 3.040473
H  -5.195441 0.577389 2.491979
H  -3.551638 0.347026 3.070867
H  -5.66487 2.065678 -0.278532
H  -4.712559 3.430513 0.283804
H  -4.294957 2.624179 -1.225303
H  -3.415167 -2.27639 -2.286558
H  -2.062231 -1.542292 -3.118043
H  -2.130412 3.649057 -0.444164
H  -1.020584 0.323259 2.025786
H  0.164595 4.396913 -0.495159
H  1.294127 1.083432 1.99557
H  -0.1303 -0.913707 -1.034879
H  -2.760112 -4.281934 -1.303648
H  -1.208992 -5.599804 0.099334
H  2.16117 5.148534 0.423564
H  2.377981 4.155038 -1.022166
H  4.494687 5.246279 -0.347065
H  4.443458 4.454444 1.225605
H  4.657161 3.495868 -0.248972
H  3.181253 -0.472584 1.616407
H  2.016941 -2.126463 -2.169198
H  4.794442 0.998085 0.471408
H  3.605742 -0.645248 -3.297456
H  5.004276 0.933925 -2.000493
elementType: Si F O C H
totalener: -1510.07011314 hartree
nucrepener: 2944.08065882 hartree
electener: -4454.15077196 hartree
oneelecener: -7918.93011143 hartree
twoeener: 3464.77933947 hartree
cpcmener: -0.02409410 hartree
kineticenergy: 1503.91123711 hartree
xcener: -135.232791025268 hartree
chargesum: 0.0000000
charge: 0.493482 -0.217352 -0.326110 -0.326658 -0.268893 -0.116520 -0.166882 -0.430695 -0.445294 -0.109303 -0.124736 -0.127588 -0.004374 -0.257528 -0.313306 0.378777 -0.268913 -0.173525 0.279935 -0.167203 0.172807 0.052775 -0.276338 0.342101 -0.286175 -0.217419 -0.146552 -0.141842 -0.177393 0.083798 0.090025 0.072817 0.091463 0.102670 0.101901 0.100311 0.109129 0.109378 0.101377 0.081027 0.095663 0.142428 0.131714 0.135981 0.143154 0.147653 0.137861 0.147133 0.101699 0.094775 0.094417 0.090464 0.079346 0.149298 0.155819 0.164019 0.158303 0.157099
qa: 0.4935 -0.2174 -0.3261 -0.3267 -0.2689 -0.1165 -0.1669 -0.4307 -0.4453 -0.1093 -0.1247 -0.1276 -0.0044 -0.2575 -0.3133 0.3788 -0.2689 -0.1735 0.2799 -0.1672 0.1728 0.0528 -0.2763 0.3421 -0.2862 -0.2174 -0.1466 -0.1418 -0.1774 0.0838 0.0900 0.0728 0.0915 0.1027 0.1019 0.1003 0.1091 0.1094 0.1014 0.0810 0.0957 0.1424 0.1317 0.1360 0.1432 0.1477 0.1379 0.1471 0.1017 0.0948 0.0944 0.0905 0.0793 0.1493 0.1558 0.1640 0.1583 0.1571
va: 4.1337 1.0688 2.0727 2.0737 3.8408 3.8504 3.7428 3.8966 3.9200 3.8583 3.8788 3.8495 3.7060 3.9260 4.0100 3.7114 3.9009 3.8894 3.5670 3.8800 4.0784 3.7933 3.9753 3.6426 3.9546 3.9042 3.8533 3.9032 3.8943 1.0112 1.0162 1.0088 1.0056 1.0088 1.0093 1.0098 1.0088 1.0081 1.0063 1.0074 1.0021 0.9897 0.9952 1.0126 1.0077 0.9935 1.0022 0.9988 0.9879 0.9871 1.0076 1.0031 1.0027 1.0075 0.9972 0.9833 0.9901 0.9908
dispcorr: -0.032462851 hartree
energy: -1510.102575990541
dipole: -14.86101 14.23154 -0.62946 28.41058 -27.09152 1.31906 -6.52009 5.06777 -1.45232
magnitude: 2.06043 au
magnitude: 5.23720 debye
