program: Orca
programVersion: 5.0.2
elementType: Si F O O C C C C C C C C C C C C C C C C C C C C C C C C C H H H H H H H H H H H H H H H H H H H H H H H H H H H H H
charge: 0
multiplicity: 1
keywords: wb97x-d3
keywords: def2-TZVPP
keywords: def2/J RIJCOSX
keywords: DEFGRID2
keywords: scfconv7
keywords: smallprint printgap noloewdin
keywords: NOSOSCF
formula: C25H29FO2Si
InChI: InChI=1/C25H29FO2Si/c1-4-27-21-13-15-23(16-14-21)29(2,3)18-8-9-20-12-17-24(26)25(19-20)28-22-10-6-5-7-11-22/h5-7,10-17,19H,4,8-9,18H2,1-3H3
58 atoms
Si -3.555534 1.36724 0.113413
F  1.501722 -3.042422 1.880174
O  2.247721 1.608698 1.809226
O  2.064983 -1.911762 -0.413573
C  -3.814395 -0.42509 -0.424699
C  -3.080639 -0.790087 -1.720452
C  -1.756343 1.517973 0.656215
C  -4.688473 1.777659 1.562241
C  -3.88801 2.546768 -1.315499
C  -2.659404 -2.264747 -1.804114
C  -1.167806 0.527148 1.454177
C  -0.943912 2.591166 0.294344
C  -1.548463 -2.568879 -0.837704
C  0.156085 0.590571 1.844234
C  0.390358 2.680273 0.678123
C  0.955768 1.660561 1.438488
C  -0.254009 -2.140759 -1.135549
C  -1.784437 -3.190575 0.382147
C  0.772075 -2.276948 -0.215195
C  -0.756557 -3.366518 1.301595
C  0.500684 -2.899641 0.999246
C  3.151522 2.587283 1.313328
C  4.545464 2.182062 1.722022
C  2.449981 -0.832902 -1.156874
C  1.635465 0.250215 -1.460707
C  3.778502 -0.849543 -1.569671
C  2.1593 1.304961 -2.197346
C  4.289083 0.216644 -2.291869
C  3.480059 1.297513 -2.619103
H  -3.470692 -1.054471 0.403675
H  -4.881743 -0.645362 -0.52464
H  -2.181026 -0.178311 -1.852759
H  -3.720817 -0.55394 -2.573935
H  -5.742188 1.688791 1.287639
H  -4.515431 1.110109 2.409398
H  -4.528469 2.798384 1.916495
H  -3.224736 2.368029 -2.164153
H  -4.912892 2.431726 -1.676261
H  -3.7701 3.592149 -1.02227
H  -3.520772 -2.90711 -1.604774
H  -2.329304 -2.484535 -2.822743
H  -1.748594 -0.32972 1.778916
H  -1.344464 3.393866 -0.315112
H  0.590569 -0.199559 2.445113
H  0.972667 3.533019 0.355163
H  -0.058432 -1.686839 -2.09921
H  -2.778629 -3.542127 0.627296
H  -0.936047 -3.852447 2.252334
H  2.902714 3.574092 1.718713
H  3.082149 2.648703 0.222437
H  5.259088 2.920473 1.356053
H  4.64962 2.127538 2.806297
H  4.818204 1.215702 1.296155
H  0.607206 0.297432 -1.130412
H  4.407646 -1.69384 -1.316178
H  1.517204 2.143888 -2.4333
H  5.325015 0.19644 -2.604988
H  3.876668 2.125735 -3.191293
elementType: Si F O C H
totalener: -1510.06768918 hartree
nucrepener: 3057.96421570 hartree
electener: -4568.03190488 hartree
oneelecener: -8146.57915444 hartree
twoeener: 3578.54724956 hartree
cpcmener: -0.02256696 hartree
kineticenergy: 1503.90678156 hartree
xcener: -135.236852954561 hartree
chargesum: -0.0000000
charge: 0.466838 -0.219265 -0.326502 -0.319098 -0.275115 -0.131738 -0.187209 -0.417713 -0.442007 -0.090975 -0.117903 -0.072961 0.075730 -0.271648 -0.318368 0.377908 -0.255267 -0.263204 0.258739 -0.114107 0.128874 0.036694 -0.269670 0.352355 -0.172384 -0.246841 -0.215981 -0.141252 -0.157632 0.076824 0.095463 0.067743 0.094320 0.100004 0.099673 0.100529 0.107584 0.110823 0.105369 0.083577 0.095379 0.139662 0.137803 0.131105 0.135828 0.156543 0.143658 0.146555 0.110958 0.090115 0.089764 0.091759 0.084035 0.126586 0.141951 0.153155 0.155800 0.157135
qa: 0.4668 -0.2193 -0.3265 -0.3191 -0.2751 -0.1317 -0.1872 -0.4177 -0.4420 -0.0910 -0.1179 -0.0730 0.0757 -0.2716 -0.3184 0.3779 -0.2553 -0.2632 0.2587 -0.1141 0.1289 0.0367 -0.2697 0.3524 -0.1724 -0.2468 -0.2160 -0.1413 -0.1576 0.0768 0.0955 0.0677 0.0943 0.1000 0.0997 0.1005 0.1076 0.1108 0.1054 0.0836 0.0954 0.1397 0.1378 0.1311 0.1358 0.1565 0.1437 0.1466 0.1110 0.0901 0.0898 0.0918 0.0840 0.1266 0.1420 0.1532 0.1558 0.1571
va: 4.1349 1.0602 2.0560 2.0944 3.8390 3.8865 3.7435 3.8968 3.9086 3.8681 3.8134 3.7976 3.5771 3.9821 3.8790 3.6596 3.9098 3.8953 3.6262 3.8354 4.0245 3.7972 3.9698 3.6347 3.7980 3.9539 3.9051 3.8949 3.8789 1.0193 1.0143 1.0016 1.0075 1.0102 1.0101 1.0102 1.0060 1.0086 1.0090 1.0078 1.0066 0.9830 0.9883 1.0174 1.0121 0.9979 1.0026 0.9981 0.9912 0.9825 1.0061 1.0046 1.0043 0.9932 1.0108 0.9967 0.9897 0.9900
dispcorr: -0.037304093 hartree
energy: -1510.104993271643
dipole: -16.13222 15.44607 -0.68615 20.82584 -19.82048 1.00536 -7.36344 6.19623 -1.16721
magnitude: 1.68640 au
magnitude: 4.28648 debye
