program: Orca
programVersion: 5.0.2
elementType: Si F O O C C C C C C C C C C C C C C C C C C C C C C C C C H H H H H H H H H H H H H H H H H H H H H H H H H H H H H
charge: 0
multiplicity: 1
keywords: wb97x-d3
keywords: def2-TZVPP
keywords: def2/J RIJCOSX
keywords: DEFGRID2
keywords: scfconv7
keywords: smallprint printgap noloewdin
keywords: NOSOSCF
formula: C25H29FO2Si
InChI: InChI=1/C25H29FO2Si/c1-4-27-21-13-15-23(16-14-21)29(2,3)18-8-9-20-12-17-24(26)25(19-20)28-22-10-6-5-7-11-22/h5-7,10-17,19H,4,8-9,18H2,1-3H3
58 atoms
Si -3.609207 -0.037996 1.557187
F  1.49439 2.042934 -2.375773
O  1.804642 2.613748 1.098005
O  1.982783 -0.1197 -0.89927
C  -3.939461 -0.732994 -0.166444
C  -3.066619 -1.949886 -0.511578
C  -1.903669 0.753946 1.494442
C  -3.638662 -1.398446 2.854887
C  -4.891857 1.275882 1.970258
C  -2.481748 -1.908013 -1.926475
C  -0.793873 0.256372 2.172781
C  -1.698518 1.890654 0.701586
C  -1.431893 -0.840762 -2.080231
C  0.46367 0.84625 2.077863
C  -0.461765 2.494527 0.591643
C  0.636949 1.971298 1.276823
C  -0.208254 -0.992347 -1.429205
C  -1.650049 0.312157 -2.825511
C  0.7815 -0.029882 -1.533103
C  -0.668816 1.292056 -2.927698
C  0.534957 1.110682 -2.286701
C  2.958691 2.168196 1.793943
C  4.107624 3.071699 1.420319
C  2.57506 -1.353545 -0.80017
C  2.807499 -2.127264 -1.93054
C  2.975348 -1.788803 0.452903
C  3.450456 -3.34822 -1.794415
C  3.627215 -3.009217 0.573911
C  3.863113 -3.794253 -0.545019
H  -4.998147 -0.980561 -0.287245
H  -3.755526 0.087191 -0.87013
H  -3.656336 -2.862323 -0.399192
H  -2.232574 -2.061404 0.190379
H  -3.427369 -1.008372 3.85303
H  -4.622733 -1.871171 2.897099
H  -2.912507 -2.188266 2.652323
H  -4.906659 2.078763 1.229724
H  -5.897525 0.849935 2.002657
H  -4.70049 1.734104 2.94292
H  -2.038232 -2.880632 -2.157209
H  -3.282785 -1.749137 -2.652564
H  -0.89025 -0.62058 2.803275
H  -2.523888 2.325575 0.147457
H  1.288107 0.412011 2.62784
H  -0.333513 3.372946 -0.029417
H  -0.025641 -1.880497 -0.834632
H  -2.59217 0.453733 -3.340017
H  -0.839526 2.190076 -3.507792
H  3.19172 1.132669 1.526213
H  2.78532 2.198049 2.875368
H  4.308755 3.04024 0.348918
H  3.916534 4.106023 1.708441
H  5.008808 2.742727 1.937993
H  2.495875 -1.781409 -2.908549
H  2.779533 -1.180456 1.326849
H  3.633362 -3.951457 -2.674286
H  3.94243 -3.347598 1.552497
H  4.36653 -4.746941 -0.445785
elementType: Si F O C H
totalener: -1510.06848661 hartree
nucrepener: 3049.01494556 hartree
electener: -4559.08343217 hartree
oneelecener: -8129.52940981 hartree
twoeener: 3570.44597764 hartree
cpcmener: -0.02593130 hartree
kineticenergy: 1503.92958764 hartree
xcener: -135.236579045282 hartree
chargesum: 0.0000000
charge: 0.467915 -0.222370 -0.323633 -0.327400 -0.267145 -0.118832 -0.136524 -0.431694 -0.438206 -0.104241 -0.151192 -0.134414 0.054675 -0.250107 -0.287394 0.369985 -0.198274 -0.214180 0.170351 -0.140326 0.176688 0.052949 -0.272570 0.261987 -0.158153 -0.221023 -0.157433 -0.159583 -0.160417 0.096356 0.074187 0.094708 0.061722 0.107806 0.108946 0.100084 0.098796 0.101937 0.102628 0.097301 0.086247 0.139997 0.131113 0.138351 0.129081 0.142596 0.140415 0.143404 0.083420 0.100556 0.087248 0.089041 0.088800 0.153621 0.149218 0.158411 0.156408 0.158164
qa: 0.4679 -0.2224 -0.3236 -0.3274 -0.2671 -0.1188 -0.1365 -0.4317 -0.4382 -0.1042 -0.1512 -0.1344 0.0547 -0.2501 -0.2874 0.3700 -0.1983 -0.2142 0.1704 -0.1403 0.1767 0.0529 -0.2726 0.2620 -0.1582 -0.2210 -0.1574 -0.1596 -0.1604 0.0964 0.0742 0.0947 0.0617 0.1078 0.1089 0.1001 0.0988 0.1019 0.1026 0.0973 0.0862 0.1400 0.1311 0.1384 0.1291 0.1426 0.1404 0.1434 0.0834 0.1006 0.0872 0.0890 0.0888 0.1536 0.1492 0.1584 0.1564 0.1582
va: 4.1432 1.0586 2.0644 2.0215 3.8348 3.8682 3.6974 3.9106 3.9030 3.8610 3.8699 3.8557 3.6167 3.8406 3.9979 3.6413 3.8559 3.8756 3.5534 3.8658 4.0159 3.8094 3.9735 3.7275 3.9236 3.9457 3.9081 3.9423 3.8880 1.0109 1.0183 1.0076 1.0068 1.0079 1.0091 1.0091 1.0112 1.0104 1.0091 1.0050 1.0070 0.9896 0.9936 1.0109 1.0161 1.0080 1.0032 1.0006 0.9793 0.9903 1.0049 1.0043 1.0060 0.9978 0.9998 0.9903 0.9919 0.9896
dispcorr: -0.035793807 hartree
energy: -1510.104280421150
dipole: -15.73362 15.45696 -0.27666 -7.92190 6.36448 -1.55742 15.53807 -15.24912 0.28895
magnitude: 1.60798 au
magnitude: 4.08715 debye
