program: Orca
programVersion: 5.0.2
elementType: Si F O O C C C C C C C C C C C C C C C C C C C C C C C C C H H H H H H H H H H H H H H H H H H H H H H H H H H H H H
charge: 0
multiplicity: 1
keywords: wb97x-d3
keywords: def2-TZVPP
keywords: def2/J RIJCOSX
keywords: DEFGRID2
keywords: scfconv7
keywords: smallprint printgap noloewdin
keywords: NOSOSCF
formula: C25H29FO2Si
InChI: InChI=1/C25H29FO2Si/c1-4-27-21-13-15-23(16-14-21)29(2,3)18-8-9-20-12-17-24(26)25(19-20)28-22-10-6-5-7-11-22/h5-7,10-17,19H,4,8-9,18H2,1-3H3
58 atoms
Si -3.561337 1.831718 0.218583
F  1.555413 -5.028441 -1.734053
O  2.223034 3.475515 0.945574
O  2.136327 -2.813764 -0.339058
C  -3.739929 0.05141 0.82829
C  -2.814154 -0.919137 0.094334
C  -1.759155 2.332988 0.462301
C  -4.69277 2.966111 1.208185
C  -3.986362 1.959491 -1.611122
C  -2.587426 -2.238308 0.840319
C  -1.114913 3.230785 -0.396797
C  -0.997628 1.818193 1.511105
C  -1.495649 -3.04697 0.198129
C  0.206925 3.597796 -0.217615
C  0.333372 2.166203 1.710284
C  0.944812 3.067808 0.842647
C  -0.184482 -2.582233 0.266908
C  -1.750824 -4.212951 -0.515506
C  0.841935 -3.237283 -0.391032
C  -0.725047 -4.89682 -1.15617
C  0.557423 -4.395313 -1.101381
C  3.029407 2.961488 1.997347
C  4.406776 3.561851 1.865793
C  2.439158 -1.516093 -0.650754
C  1.644072 -0.721974 -1.468718
C  3.630683 -1.02387 -0.13345
C  2.050054 0.574244 -1.755319
C  4.029125 0.268094 -0.44194
C  3.239977 1.077011 -1.249021
H  -3.518184 0.038178 1.902063
H  -4.783035 -0.27045 0.74473
H  -1.837831 -0.452039 -0.068081
H  -3.20912 -1.129824 -0.903586
H  -4.460113 2.935044 2.274892
H  -4.597769 4.005073 0.884731
H  -5.742164 2.683935 1.094272
H  -3.940483 2.98995 -1.969951
H  -3.311947 1.367196 -2.232798
H  -5.001559 1.602097 -1.799272
H  -2.312776 -2.011744 1.875004
H  -3.514662 -2.814663 0.88133
H  -1.650438 3.659924 -1.236551
H  -1.437999 1.113184 2.208229
H  0.67962 4.295468 -0.898883
H  0.870425 1.72819 2.540755
H  0.038986 -1.682548 0.830357
H  -2.761006 -4.598217 -0.577332
H  -0.924365 -5.805678 -1.709637
H  3.081822 1.869166 1.937575
H  2.592973 3.218949 2.968537
H  5.046966 3.176101 2.659229
H  4.868286 3.305356 0.911228
H  4.381846 4.648345 1.956806
H  0.718731 -1.095681 -1.887668
H  4.243011 -1.653364 0.500358
H  1.42605 1.19074 -2.389532
H  4.961855 0.643804 -0.040803
H  3.55055 2.085885 -1.485192
elementType: Si F O C H
totalener: -1510.07115203 hartree
nucrepener: 2920.30387075 hartree
electener: -4430.37502277 hartree
oneelecener: -7870.73215176 hartree
twoeener: 3440.35712898 hartree
cpcmener: -0.02395199 hartree
kineticenergy: 1503.90474958 hartree
xcener: -135.229203482497 hartree
chargesum: -0.0000000
charge: 0.484445 -0.216971 -0.321362 -0.330213 -0.274359 -0.140093 -0.157429 -0.415983 -0.440610 -0.058184 -0.082114 -0.153280 0.023677 -0.303317 -0.242739 0.332761 -0.231682 -0.194306 0.205806 -0.165896 0.183641 0.015752 -0.270696 0.321231 -0.203927 -0.244175 -0.162643 -0.146151 -0.165275 0.077250 0.094836 0.063275 0.097997 0.099926 0.099851 0.100874 0.104716 0.108725 0.110370 0.088108 0.083287 0.134507 0.139082 0.131586 0.135801 0.146556 0.140528 0.147619 0.098766 0.118291 0.092698 0.082818 0.093233 0.152531 0.143467 0.155546 0.157797 0.154050
qa: 0.4844 -0.2170 -0.3214 -0.3302 -0.2744 -0.1401 -0.1574 -0.4160 -0.4406 -0.0582 -0.0821 -0.1533 0.0237 -0.3033 -0.2427 0.3328 -0.2317 -0.1943 0.2058 -0.1659 0.1836 0.0158 -0.2707 0.3212 -0.2039 -0.2442 -0.1626 -0.1462 -0.1653 0.0772 0.0948 0.0633 0.0980 0.0999 0.0999 0.1009 0.1047 0.1087 0.1104 0.0881 0.0833 0.1345 0.1391 0.1316 0.1358 0.1466 0.1405 0.1476 0.0988 0.1183 0.0927 0.0828 0.0932 0.1525 0.1435 0.1555 0.1578 0.1541
va: 4.1393 1.0702 2.0522 2.0875 3.8652 3.8631 3.7229 3.8932 3.8977 3.7919 3.8378 3.8687 3.6604 4.0150 3.8799 3.7009 3.9298 3.9083 3.6808 3.8707 4.0720 3.8039 3.9657 3.6762 3.8683 4.0023 3.8831 3.8596 3.8149 1.0163 1.0146 0.9977 1.0093 1.0093 1.0101 1.0090 1.0092 1.0048 1.0078 1.0091 1.0136 0.9894 0.9906 1.0163 1.0133 1.0014 1.0034 0.9983 0.9804 0.9911 1.0053 1.0035 1.0046 0.9999 1.0090 0.9950 0.9882 0.9971
dispcorr: -0.032595734 hartree
energy: -1510.103747759236
dipole: -16.73702 15.88907 -0.84795 27.93883 -27.40130 0.53753 9.96851 -9.09131 0.87720
magnitude: 1.33321 au
magnitude: 3.38875 debye
