program: Orca
programVersion: 5.0.2
elementType: Si F O O C C C C C C C C C C C C C C C C C C C C C C C C C H H H H H H H H H H H H H H H H H H H H H H H H H H H H H
charge: 0
multiplicity: 1
keywords: wb97x-d3
keywords: def2-TZVPP
keywords: def2/J RIJCOSX
keywords: DEFGRID2
keywords: scfconv7
keywords: smallprint printgap noloewdin
keywords: NOSOSCF
formula: C25H29FO2Si
InChI: InChI=1/C25H29FO2Si/c1-4-27-21-13-15-23(16-14-21)29(2,3)18-8-9-20-12-17-24(26)25(19-20)28-22-10-6-5-7-11-22/h5-7,10-17,19H,4,8-9,18H2,1-3H3
58 atoms
Si -3.542942 1.800156 0.436436
F  1.414201 -5.413296 0.298064
O  2.202358 3.67945 0.046764
O  2.118364 -2.924416 -0.388596
C  -3.722689 0.306426 -0.707731
C  -2.768525 -0.829582 -0.33996
C  -1.763584 2.408567 0.283803
C  -3.858216 1.308085 2.226799
C  -4.753749 3.15218 -0.06605
C  -2.551081 -1.849265 -1.462118
C  -1.103905 3.047849 1.340457
C  -1.026701 2.215763 -0.883926
C  -1.498419 -2.849176 -1.074902
C  0.210679 3.466573 1.239302
C  0.29664 2.621517 -1.009831
C  0.926401 3.252757 0.059647
C  -0.172673 -2.433146 -0.97213
C  -1.813886 -4.160334 -0.737166
C  0.809733 -3.287464 -0.500476
C  -0.833026 -5.036953 -0.291388
C  0.463023 -4.588464 -0.16131
C  2.989188 3.459863 -1.116669
C  4.376644 3.98881 -0.853298
C  2.444483 -1.725705 0.188797
C  1.696569 -1.151795 1.210392
C  3.60723 -1.116084 -0.263041
C  2.121433 0.045635 1.769745
C  4.026351 0.072776 0.316779
C  3.285607 0.662267 1.332425
H  -4.759365 -0.045519 -0.703091
H  -3.534312 0.638721 -1.735461
H  -3.134865 -1.347721 0.551004
H  -1.790484 -0.4236 -0.063233
H  -4.844366 0.851107 2.338508
H  -3.122211 0.587849 2.589924
H  -3.828858 2.169194 2.898049
H  -4.642108 4.04054 0.55962
H  -4.604002 3.463808 -1.102013
H  -5.789058 2.815892 0.027713
H  -3.489162 -2.357598 -1.69768
H  -2.244192 -1.317852 -2.367885
H  -1.620476 3.223457 2.277884
H  -1.479835 1.725719 -1.738774
H  0.696751 3.955727 2.075219
H  0.813949 2.435181 -1.941317
H  0.093708 -1.417677 -1.24503
H  -2.836665 -4.507107 -0.815884
H  -1.077161 -6.058045 -0.027321
H  2.54437 3.973523 -1.975935
H  3.026994 2.391407 -1.353542
H  4.366702 5.060224 -0.649828
H  4.85007 3.48177 -0.011552
H  4.997947 3.823016 -1.733609
H  0.793669 -1.624203 1.575899
H  4.181456 -1.573382 -1.05923
H  1.535907 0.492683 2.562764
H  4.936573 0.54151 -0.035273
H  3.612685 1.590472 1.781576
elementType: Si F O C H
totalener: -1510.07111069 hartree
nucrepener: 2913.27600494 hartree
electener: -4423.34711564 hartree
oneelecener: -7856.60012634 hartree
twoeener: 3433.25301071 hartree
cpcmener: -0.02390282 hartree
kineticenergy: 1503.90359461 hartree
xcener: -135.228633901153 hartree
chargesum: 0.0000000
charge: 0.486632 -0.217469 -0.321757 -0.331901 -0.276828 -0.144426 -0.154609 -0.441787 -0.417385 -0.053478 -0.088378 -0.151607 0.019820 -0.297117 -0.238092 0.324852 -0.220536 -0.200874 0.203121 -0.163757 0.182157 0.017795 -0.270273 0.303630 -0.195244 -0.237072 -0.163377 -0.149657 -0.158627 0.094983 0.078134 0.099509 0.064434 0.110648 0.108680 0.105948 0.099559 0.100427 0.100867 0.083214 0.087808 0.133716 0.138844 0.130915 0.135065 0.143297 0.140313 0.147147 0.116977 0.098583 0.093032 0.083119 0.092035 0.153684 0.145345 0.157510 0.157861 0.154590
qa: 0.4866 -0.2175 -0.3218 -0.3319 -0.2768 -0.1444 -0.1546 -0.4418 -0.4174 -0.0535 -0.0884 -0.1516 0.0198 -0.2971 -0.2381 0.3249 -0.2205 -0.2009 0.2031 -0.1638 0.1822 0.0178 -0.2703 0.3036 -0.1952 -0.2371 -0.1634 -0.1497 -0.1586 0.0950 0.0781 0.0995 0.0644 0.1106 0.1087 0.1059 0.0996 0.1004 0.1009 0.0832 0.0878 0.1337 0.1388 0.1309 0.1351 0.1433 0.1403 0.1471 0.1170 0.0986 0.0930 0.0831 0.0920 0.1537 0.1453 0.1575 0.1579 0.1546
va: 4.1355 1.0689 2.0509 2.0838 3.8663 3.8656 3.7253 3.8951 3.8934 3.7943 3.8452 3.8742 3.6704 4.0141 3.8779 3.7119 3.9154 3.9110 3.6897 3.8727 4.0652 3.8017 3.9663 3.6866 3.8796 4.0086 3.8868 3.8603 3.8179 1.0147 1.0161 1.0083 0.9966 1.0078 1.0046 1.0096 1.0102 1.0093 1.0091 1.0138 1.0100 0.9900 0.9904 1.0161 1.0134 1.0035 1.0035 0.9985 0.9914 0.9801 1.0045 1.0030 1.0055 0.9988 1.0077 0.9946 0.9892 0.9975
dispcorr: -0.032302013 hartree
energy: -1510.103412704998
dipole: -16.16677 15.38306 -0.78371 29.97340 -29.13543 0.83797 -1.63154 0.90698 -0.72457
magnitude: 1.35698 au
magnitude: 3.44916 debye
