program: Orca
programVersion: 5.0.2
elementType: Si F O O C C C C C C C C C C C C C C C C C C C C C C C C C H H H H H H H H H H H H H H H H H H H H H H H H H H H H H
charge: 0
multiplicity: 1
keywords: wb97x-d3
keywords: def2-TZVPP
keywords: def2/J RIJCOSX
keywords: DEFGRID2
keywords: scfconv7
keywords: smallprint printgap noloewdin
keywords: NOSOSCF
formula: C25H29FO2Si
InChI: InChI=1/C25H29FO2Si/c1-4-27-21-13-15-23(16-14-21)29(2,3)18-8-9-20-12-17-24(26)25(19-20)28-22-10-6-5-7-11-22/h5-7,10-17,19H,4,8-9,18H2,1-3H3
58 atoms
Si -2.982305 1.397818 0.062296
F  1.274093 -4.32231 1.344493
O  2.146488 4.115602 1.795894
O  1.89179 -2.809111 -0.768374
C  -2.403055 -0.123121 -0.896961
C  -3.453663 -1.187915 -1.198198
C  -1.422618 2.28009 0.646137
C  -3.980351 0.846033 1.5620
C  -4.013712 2.545653 -1.012248
C  -2.883999 -2.428262 -1.908415
C  -0.587471 1.674865 1.587251
C  -1.003325 3.514691 0.142162
C  -1.768832 -3.04628 -1.114926
C  0.609454 2.243795 2.002012
C  0.185341 4.103368 0.54026
C  1.010023 3.468405 1.470018
C  -0.446506 -2.709807 -1.387583
C  -2.038406 -3.862146 -0.019362
C  0.583266 -3.122991 -0.554854
C  -1.014838 -4.312879 0.800808
C  0.281406 -3.924176 0.536671
C  3.15664 3.451694 2.546673
C  3.901013 2.403461 1.746675
C  2.235742 -1.543571 -1.16453
C  1.550925 -0.410361 -0.741607
C  3.348633 -1.429691 -1.986352
C  1.973208 0.838787 -1.173545
C  3.771449 -0.17257 -2.393536
C  3.081972 0.966156 -1.999031
H  -1.916615 0.206092 -1.822897
H  -1.603905 -0.563824 -0.292037
H  -4.251256 -0.773112 -1.821359
H  -3.931426 -1.509983 -0.267804
H  -4.911731 0.357237 1.267282
H  -3.425925 0.135848 2.18004
H  -4.247221 1.692649 2.198246
H  -3.471688 2.879038 -1.899547
H  -4.917067 2.039225 -1.360457
H  -4.335944 3.435453 -0.467232
H  -3.687708 -3.153107 -2.059719
H  -2.521557 -2.143504 -2.899358
H  -0.860729 0.717579 2.019528
H  -1.61037 4.039463 -0.587113
H  1.212389 1.71761 2.730072
H  0.487317 5.058776 0.127467
H  -0.221969 -2.085446 -2.244385
H  -3.0596 -4.142506 0.208119
H  -1.2215 -4.945803 1.654476
H  2.744108 3.028281 3.467467
H  3.842316 4.244711 2.845325
H  3.275895 1.554178 1.471551
H  4.321516 2.829277 0.834703
H  4.728261 2.019006 2.345333
H  0.695247 -0.487705 -0.083561
H  3.878723 -2.319168 -2.30342
H  1.430095 1.718302 -0.85061
H  4.640028 -0.087755 -3.033975
H  3.406791 1.944196 -2.328836
elementType: Si F O C H
totalener: -1510.06716135 hartree
nucrepener: 2945.92384621 hartree
electener: -4455.99100756 hartree
oneelecener: -7921.72074227 hartree
twoeener: 3465.72973471 hartree
cpcmener: -0.02247179 hartree
kineticenergy: 1503.90728646 hartree
xcener: -135.233635009844 hartree
chargesum: 0.0000000
charge: 0.506057 -0.218115 -0.334607 -0.330813 -0.213695 -0.161325 -0.147516 -0.434062 -0.448335 -0.092345 -0.196669 -0.100589 0.056315 -0.241511 -0.253436 0.306551 -0.244079 -0.218583 0.229923 -0.166112 0.179515 0.043366 -0.255372 0.300876 -0.204511 -0.259310 -0.130667 -0.099190 -0.222785 0.091936 0.052491 0.083388 0.082176 0.104878 0.106292 0.109903 0.102586 0.105980 0.108370 0.092842 0.084792 0.138734 0.137766 0.139942 0.130004 0.145420 0.142057 0.148055 0.084608 0.107348 0.081034 0.087141 0.099609 0.180184 0.145067 0.148962 0.157118 0.152339
qa: 0.5061 -0.2181 -0.3346 -0.3308 -0.2137 -0.1613 -0.1475 -0.4341 -0.4483 -0.0923 -0.1967 -0.1006 0.0563 -0.2415 -0.2534 0.3066 -0.2441 -0.2186 0.2299 -0.1661 0.1795 0.0434 -0.2554 0.3009 -0.2045 -0.2593 -0.1307 -0.0992 -0.2228 0.0919 0.0525 0.0834 0.0822 0.1049 0.1063 0.1099 0.1026 0.1060 0.1084 0.0928 0.0848 0.1387 0.1378 0.1399 0.1300 0.1454 0.1421 0.1481 0.0846 0.1073 0.0810 0.0871 0.0996 0.1802 0.1451 0.1490 0.1571 0.1523
va: 4.1013 1.0674 2.0716 2.0923 3.8062 3.9209 3.7202 3.8821 3.9256 3.8512 3.8752 3.8612 3.6038 3.8301 4.0188 3.7332 3.9136 3.9106 3.6563 3.8804 4.0677 3.8731 3.9107 3.7566 3.8390 4.0074 3.7804 3.8671 3.9527 1.0142 1.0335 1.0120 1.0006 1.0059 1.0071 1.0093 1.0091 1.0104 1.0078 1.0083 1.0108 0.9957 0.9893 1.0061 1.0158 1.0039 1.0019 0.9981 0.9945 0.9912 0.9984 1.0073 1.0119 0.9764 1.0081 1.0015 0.9877 0.9949
dispcorr: -0.033654680 hartree
energy: -1510.100816025913
dipole: -15.36152 14.70320 -0.65833 20.50796 -20.22837 0.27959 -1.82933 1.62573 -0.20360
magnitude: 0.74365 au
magnitude: 1.89021 debye
