program: Orca
programVersion: 5.0.2
elementType: Si F O O C C C C C C C C C C C C C C C C C C C C C C C C C H H H H H H H H H H H H H H H H H H H H H H H H H H H H H
charge: 0
multiplicity: 1
keywords: wb97x-d3
keywords: def2-TZVPP
keywords: def2/J RIJCOSX
keywords: DEFGRID2
keywords: scfconv7
keywords: smallprint printgap noloewdin
keywords: NOSOSCF
formula: C25H29FO2Si
InChI: InChI=1/C25H29FO2Si/c1-4-27-21-13-15-23(16-14-21)29(2,3)18-8-9-20-12-17-24(26)25(19-20)28-22-10-6-5-7-11-22/h5-7,10-17,19H,4,8-9,18H2,1-3H3
58 atoms
Si -4.022202 1.067016 1.106939
F  1.923631 -2.918859 0.8148
O  1.454875 3.653816 1.081998
O  1.90584 -0.718479 -0.808802
C  -3.855614 -0.525152 0.105748
C  -3.389539 -0.313884 -1.335931
C  -2.316466 1.867966 1.147719
C  -4.580945 0.636873 2.853572
C  -5.254096 2.253785 0.321235
C  -2.765451 -1.561384 -1.975558
C  -1.164635 1.089216 1.266619
C  -2.127245 3.249235 1.03495
C  -1.500046 -1.975996 -1.276733
C  0.112479 1.635635 1.260454
C  -0.866015 3.818791 1.031099
C  0.270389 3.014201 1.133427
C  -0.341905 -1.210992 -1.415964
C  -1.464634 -3.079786 -0.431802
C  0.808398 -1.525808 -0.71546
C  -0.314687 -3.410408 0.275231
C  0.806444 -2.625059 0.134633
C  2.669013 2.912065 1.078657
C  3.118495 2.504039 2.464939
C  3.062902 -1.214528 -1.344106
C  3.099421 -2.328061 -2.172575
C  4.226706 -0.517287 -1.043491
C  4.319464 -2.747801 -2.687115
C  5.434445 -0.945795 -1.570446
C  5.489982 -2.065696 -2.390338
H  -3.144447 -1.159823 0.647339
H  -4.800536 -1.078179 0.120516
H  -2.656629 0.497836 -1.391171
H  -4.234803 0.009294 -1.948962
H  -4.668519 1.52753 3.479711
H  -5.554609 0.141217 2.853643
H  -3.872707 -0.035824 3.342887
H  -6.234434 1.781424 0.223281
H  -5.394329 3.153825 0.923799
H  -4.947383 2.572694 -0.676904
H  -3.484067 -2.38439 -1.955211
H  -2.554088 -1.353584 -3.027981
H  -1.243684 0.011559 1.36375
H  -2.981789 3.909638 0.93712
H  0.961276 0.972311 1.354158
H  -0.750257 4.891935 0.934411
H  -0.332078 -0.344112 -2.06724
H  -2.348792 -3.693302 -0.311749
H  -0.294495 -4.26644 0.937692
H  3.406129 3.583468 0.63663
H  2.588857 2.046758 0.41358
H  4.092798 2.017733 2.39649
H  3.227681 3.374306 3.113288
H  2.434229 1.804285 2.945214
H  2.196731 -2.86891 -2.427849
H  4.183886 0.351093 -0.396975
H  4.346313 -3.617785 -3.330687
H  6.339221 -0.401781 -1.331389
H  6.43563 -2.400685 -2.795385
elementType: Si F O C H
totalener: -1510.06887651 hartree
nucrepener: 2922.93895809 hartree
electener: -4433.00783460 hartree
oneelecener: -7876.16497913 hartree
twoeener: 3443.15714453 hartree
cpcmener: -0.02278285 hartree
kineticenergy: 1503.90068639 hartree
xcener: -135.228972094807 hartree
chargesum: -0.0000000
charge: 0.471133 -0.218346 -0.339440 -0.325665 -0.268936 -0.138362 -0.175830 -0.413099 -0.448336 -0.089720 -0.172744 -0.081953 0.034634 -0.232688 -0.294571 0.361293 -0.219672 -0.180808 0.130399 -0.161405 0.255989 0.066667 -0.260272 0.290830 -0.178767 -0.252172 -0.161799 -0.135329 -0.181614 0.076288 0.093508 0.080235 0.092661 0.100408 0.100286 0.100017 0.109279 0.105369 0.108364 0.083057 0.097778 0.135313 0.135740 0.131191 0.131335 0.132682 0.143873 0.148215 0.110353 0.058993 0.091093 0.092435 0.089796 0.151189 0.151223 0.157918 0.155703 0.156282
qa: 0.4711 -0.2183 -0.3394 -0.3257 -0.2689 -0.1384 -0.1758 -0.4131 -0.4483 -0.0897 -0.1727 -0.0820 0.0346 -0.2327 -0.2946 0.3613 -0.2197 -0.1808 0.1304 -0.1614 0.2560 0.0667 -0.2603 0.2908 -0.1788 -0.2522 -0.1618 -0.1353 -0.1816 0.0763 0.0935 0.0802 0.0927 0.1004 0.1003 0.1000 0.1093 0.1054 0.1084 0.0831 0.0978 0.1353 0.1357 0.1312 0.1313 0.1327 0.1439 0.1482 0.1104 0.0590 0.0911 0.0924 0.0898 0.1512 0.1512 0.1579 0.1557 0.1563
va: 4.1475 1.0669 2.0827 2.0183 3.8433 3.8683 3.7463 3.8856 3.9079 3.8535 3.8691 3.8425 3.5942 3.8657 4.0544 3.7273 3.9409 3.8602 3.6287 3.9069 4.0039 3.8621 3.9033 3.7188 3.8916 3.9573 3.9223 3.9218 3.9002 1.0170 1.0147 1.0019 1.0072 1.0099 1.0092 1.0091 1.0083 1.0088 1.0053 1.0079 1.0058 0.9850 0.9880 1.0155 1.0153 1.0197 1.0013 0.9988 0.9939 1.0171 1.0095 1.0065 1.0022 1.0027 1.0038 0.9908 0.9914 0.9904
dispcorr: -0.032019216 hartree
energy: -1510.100895724190
dipole: -19.57477 19.23561 -0.33916 11.57051 -12.44538 -0.87487 3.52773 -4.10847 -0.58073
magnitude: 1.10348 au
magnitude: 2.80482 debye
