program: Gaussian 09
title: 000063534
version: EM64L-G09RevD.01
frameworkgroup: C1[X(C12H16ClN3O)]
method: RPBEPBE
basis: SDD
operation: Freq
keyword: #p
keyword: freq=noraman
keyword: PBEPBE/SDD
title: #p freq=noraman PBEPBE/SDD
converged: YES YES NO NO
title: Mulliken charges:
elementType: Cl O N N N C C C C C C C C C C C C H H H H H H H H H H H H H H H H
charge: -0.063961 -0.274299 -0.165563 -0.373080 -0.079722 -0.463075 0.386032 -0.362725 -0.354920 0.087471 0.121881 -0.294729 -0.336445 -0.118326 -0.613693 -0.619705 -0.282876 0.252061 0.232897 0.223493 0.232288 0.189433 0.245332 0.325094 0.274566 0.275966 0.231257 0.191070 0.226633 0.230891 0.228662 0.189032 0.259061
chargesum: 0.00000
title: Mulliken charges with hydrogens summed into heavy atoms:
elementType: Cl O N N N C C C C C C C C C C C C
charge: -0.063961 -0.274299 -0.165563 -0.047986 -0.079722 0.021883 0.386032 0.093056 0.079845 0.087471 0.121881 -0.020164 -0.060479 -0.118326 0.035266 0.028880 -0.023815
polarizability: 2.01364711e+02 2.16554471e+00 2.05620579e+02 1.04702442e+01 -5.88098285e-01 9.34014729e+01
1716.lowfreq: -9.1145 0.0013 0.0024 0.0024 0.1388 6.0748 25.3599 30.3933 42.2975
frequency: 25.2377 30.1660 42.2105 83.4315 107.6873 117.7398 163.8802 187.2262 191.6204 212.2939 226.8778 241.1263 253.1846 279.5007 310.8909 335.9497 348.8058 383.6265 416.1097 429.3048 438.9994 496.3267 514.9682 541.8901 550.7412 586.5068 597.1212 672.5914 693.1415 742.7859 759.4467 792.5788 815.6797 823.0379 834.6029 845.9993 972.0812 973.5400 1002.0520 1014.4642 1033.5003 1054.1010 1062.8242 1081.1857 1082.9856 1089.8248 1119.0587 1140.3767 1145.7229 1165.8939 1198.5419 1241.4669 1255.3729 1265.9015 1272.7918 1291.4409 1299.8678 1322.1654 1331.2297 1376.7314 1378.5938 1385.9713 1420.3854 1427.3628 1445.3360 1448.3741 1463.4099 1465.7601 1475.9322 1479.0013 1483.3514 1484.9983 1489.4102 1506.2324 1556.6247 1604.4932 1631.8102 2822.0811 2850.2516 2869.1883 2876.0011 3000.3044 3024.9983 3030.3800 3033.0671 3046.8814 3066.8566 3082.6135 3087.6321 3154.1427 3176.8582 3183.5236 3552.3309
redmass: 4.1789 2.7960 4.8135 7.6752 3.8893 2.7838 3.8732 3.7834 2.8479 2.4306 1.4070 1.2774 5.1678 5.1326 4.6177 2.1633 3.2592 5.9444 3.0059 2.4151 2.8707 5.3567 1.6554 3.4223 4.4572 4.5121 6.1310 4.1570 5.4873 5.4582 3.2974 1.2939 5.7172 1.5802 3.3866 1.5601 1.4010 2.8471 2.5414 2.8730 1.6213 2.2030 2.4903 1.9239 2.0372 1.3016 1.6332 1.7037 2.2053 1.9498 2.2455 1.8411 1.3114 2.5134 2.0440 1.3865 1.3408 1.6421 1.6761 1.4206 1.7516 5.2131 1.1453 1.8533 1.3863 2.3943 1.0660 1.0724 1.0696 1.1693 1.0729 1.5187 1.1264 1.4462 8.2043 6.3016 7.1380 1.0706 1.0572 1.0571 1.0717 1.0617 1.0735 1.0809 1.0761 1.0903 1.1031 1.1012 1.1007 1.0895 1.0919 1.0963 1.0776
irintensity: 0.2560 0.1734 1.0047 0.4425 4.1512 0.4273 0.6547 4.0127 0.6255 1.5160 0.5006 1.1721 5.2796 1.1381 3.1307 8.4728 2.6896 21.2617 6.2391 1.4557 21.4414 18.4316 57.4134 12.7821 15.8623 1.3118 1.2513 28.5771 4.4298 14.9616 24.7410 3.3370 63.3960 25.3060 7.3216 34.8841 2.5288 22.3926 35.4622 22.1581 22.6678 36.4586 5.3277 7.3317 36.4854 7.5015 47.1066 5.8108 6.6023 14.8345 12.9768 28.5671 2.9494 29.7087 7.4689 14.2022 29.7232 27.7046 18.3146 5.0148 12.9594 34.4980 8.2575 125.4409 12.4840 42.5660 10.0008 16.5226 16.0042 28.0550 11.5356 60.8167 19.0505 61.1974 51.4552 245.0893 433.6927 72.0609 79.5294 137.9597 189.7360 26.5006 34.4757 44.4633 21.4763 27.7933 28.1555 27.5058 48.8896 0.7723 2.3370 1.0577 38.1141
temp: 298.150 k
press: 1.00000 atm
elementType: 17 8 7 7 7 6 6 6 6 6 6 6 6 6 6 6 6 1 1 1 1 1 1 1 1 1 1 1 1 1 1 1 1
symmnumber: 1
zpe: 699160.9 jmol-1
zpe.correction: 0.266296 hartree
zpe.thermalcorrener: 0.283084 hartree
zpe.thermalcorrenthalpy: 0.284028 hartree
zpe.thermalcorrgfe: 0.220336 hartree
zpe.sumelectzpe: -1165.130096 hartree
zpe.sumelectthermal: -1165.113309 hartree
zpe.sumelectthermalent: -1165.112365 hartree
zpe.sumelectthermalfe: -1165.176056 hartree
dipole: -6.3694 -2.2138 0.8475
dipole: 6.7962
quadrupole: -112.4301 -108.6275 -110.1593
quadrupole: 14.0772 0.3347 1.8023
quadrupole: -2.0245 1.7781 0.2464 14.0772 0.3347 1.8023
hfenergy: -1165.3963927 hartree
pointgroup: C01 [X(C12H16Cl1N3O1)]
dipole: -2.4522871 1.0133148 -0.3299234 debye
polarizability: 201.2686112|-1.7349095|205.8058816|-9.8405344|2.090542|93.3122696 unknown
InChI: InChI=1S/C12H16ClN3O/c1-15(2)5-6-16-8-14-12(17)10-4-3-9(13)7-11(10)16/h3-4,7,14H,5-6,8H2,1-2H3
charge 0 multiplicity 1
33 atoms
Cl 0.955703 -4.116235 0.140191
O  3.59677 2.218808 -0.043852
N  -0.327885 0.966874 0.384967
N  1.322543 2.699321 0.09626
N  -3.904799 -0.306387 -0.015877
C  -1.713039 0.645961 0.760585
C  0.640382 -0.020919 0.167561
C  -0.056764 2.293241 -0.194769
C  -2.614043 0.267799 -0.448322
C  1.991461 0.379942 -0.119256
C  2.39222 1.815464 -0.047154
C  0.343103 -1.413194 0.256418
C  2.988622 -0.596623 -0.336442
C  1.37192 -2.341189 0.035856
C  -4.599009 -1.015106 -1.112298
C  -4.78937 0.671132 0.65279
C  2.698914 -1.973405 -0.272266
H  -1.718547 -0.193654 1.478151
H  -2.127116 1.523552 1.291105
H  -0.755445 3.023948 0.249041
H  -0.230186 2.276418 -1.298112
H  -2.748197 1.166491 -1.108191
H  -2.086237 -0.496202 -1.048707
H  1.551153 3.688849 0.208967
H  -0.666012 -1.767779 0.476579
H  4.007606 -0.242941 -0.525364
H  -3.936515 -1.792059 -1.532802
H  -4.917749 -0.340511 -1.946666
H  -5.500637 -1.515137 -0.715967
H  -4.307791 1.076406 1.55909
H  -5.718205 0.16569 0.970202
H  -5.071701 1.530948 -0.007994
H  3.468949 -2.730405 -0.437427
