program: Orca
programVersion: 5.0.2
elementType: Si F O O C C C C C C C C C C C C C C C C C C C C C C C C C H H H H H H H H H H H H H H H H H H H H H H H H H H H H H
charge: 0
multiplicity: 1
keywords: wb97x-d3
keywords: def2-TZVPP
keywords: def2/J RIJCOSX
keywords: DEFGRID2
keywords: scfconv7
keywords: smallprint printgap noloewdin
keywords: NOSOSCF
formula: C25H29FO2Si
InChI: InChI=1/C25H29FO2Si/c1-4-27-21-13-15-23(16-14-21)29(2,3)18-8-9-20-12-17-24(26)25(19-20)28-22-10-6-5-7-11-22/h5-7,10-17,19H,4,8-9,18H2,1-3H3
58 atoms
Si -3.691199 0.980073 0.391553
F  1.545067 -2.379154 1.899933
O  2.133865 2.026508 1.627417
O  2.02373 -0.82504 -0.183257
C  -3.921468 0.584055 -1.452393
C  -2.857432 -0.14409 -2.276311
C  -1.893927 1.312193 0.826407
C  -4.382515 -0.377043 1.497942
C  -4.694002 2.547069 0.710059
C  -2.553663 -1.592953 -1.873856
C  -1.287246 0.744909 1.943824
C  -1.094617 2.140246 0.027782
C  -1.474814 -1.78839 -0.839337
C  0.050049 0.963441 2.257351
C  0.237603 2.369528 0.315242
C  0.825701 1.771907 1.432701
C  -0.21937 -1.2068 -1.018377
C  -1.680576 -2.589627 0.2777
C  0.79873 -1.411009 -0.102723
C  -0.669571 -2.796953 1.20906
C  0.55654 -2.207708 1.008608
C  2.813225 1.372038 2.691335
C  4.270679 1.754222 2.62189
C  2.61851 -0.641295 -1.402224
C  2.647241 -1.642927 -2.364981
C  3.255036 0.571354 -1.620446
C  3.318458 -1.414895 -3.557195
C  3.931495 0.780843 -2.813797
C  3.96235 -0.206424 -3.788422
H  -4.872079 0.043232 -1.537836
H  -4.112144 1.547575 -1.939099
H  -1.933701 0.440124 -2.288891
H  -3.199373 -0.157885 -3.314825
H  -4.337615 -0.097976 2.553065
H  -5.434874 -0.552959 1.26167
H  -3.862921 -1.329107 1.387434
H  -5.735233 2.426277 0.400337
H  -4.697615 2.816494 1.768566
H  -4.289511 3.399389 0.158987
H  -3.471614 -2.081689 -1.536601
H  -2.245336 -2.135676 -2.772685
H  -1.856378 0.098406 2.602025
H  -1.512937 2.617246 -0.852565
H  0.464811 0.489485 3.136824
H  0.835996 3.005681 -0.326315
H  -0.033434 -0.58008 -1.882679
H  -2.641523 -3.064325 0.43101
H  -0.835716 -3.41421 2.08284
H  2.700188 0.28655 2.603562
H  2.386149 1.672457 3.654127
H  4.809089 1.273819 3.439138
H  4.727036 1.427832 1.68654
H  4.409883 2.831411 2.720352
H  2.159782 -2.594087 -2.190105
H  3.228507 1.340323 -0.858825
H  3.342347 -2.195027 -4.307295
H  4.430329 1.726725 -2.981149
H  4.486033 -0.037842 -4.720122
elementType: Si F O C H
totalener: -1510.06547345 hartree
nucrepener: 3069.13808561 hartree
electener: -4579.20355906 hartree
oneelecener: -8169.46797254 hartree
twoeener: 3590.26441349 hartree
cpcmener: -0.02186636 hartree
kineticenergy: 1503.90663575 hartree
xcener: -135.234882142147 hartree
chargesum: -0.0000000
charge: 0.460736 -0.223861 -0.327700 -0.323526 -0.301778 -0.125564 -0.055792 -0.433584 -0.451045 -0.086252 -0.194797 -0.154166 0.043076 -0.217111 -0.272772 0.339874 -0.212249 -0.224878 0.199941 -0.141753 0.176384 0.048192 -0.271512 0.306603 -0.193761 -0.256376 -0.147649 -0.131725 -0.181905 0.086083 0.101932 0.069962 0.089914 0.105209 0.110306 0.113931 0.099011 0.097852 0.099845 0.085472 0.102511 0.139113 0.133659 0.131442 0.131836 0.146701 0.145635 0.142210 0.085102 0.105453 0.091756 0.086577 0.087906 0.152903 0.138581 0.157969 0.158415 0.157663
qa: 0.4607 -0.2239 -0.3277 -0.3235 -0.3018 -0.1256 -0.0558 -0.4336 -0.4510 -0.0863 -0.1948 -0.1542 0.0431 -0.2171 -0.2728 0.3399 -0.2122 -0.2249 0.1999 -0.1418 0.1764 0.0482 -0.2715 0.3066 -0.1938 -0.2564 -0.1476 -0.1317 -0.1819 0.0861 0.1019 0.0700 0.0899 0.1052 0.1103 0.1139 0.0990 0.0979 0.0998 0.0855 0.1025 0.1391 0.1337 0.1314 0.1318 0.1467 0.1456 0.1422 0.0851 0.1055 0.0918 0.0866 0.0879 0.1529 0.1386 0.1580 0.1584 0.1577
va: 4.1185 1.0581 2.0613 2.0296 3.8489 3.8795 3.6378 3.8869 3.9089 3.8195 3.9009 3.8822 3.6099 3.8238 3.9613 3.6957 3.8999 3.8833 3.5433 3.8898 4.0147 3.7925 3.9706 3.6885 3.9393 3.9532 3.9010 3.9158 3.9095 1.0148 1.0036 1.0090 1.0000 1.0087 1.0111 1.0145 1.0095 1.0119 1.0105 1.0043 0.9996 0.9909 0.9902 1.0130 1.0118 1.0040 0.9950 1.0017 0.9994 0.9896 1.0064 1.0020 1.0041 0.9987 1.0245 0.9904 0.9907 0.9903
dispcorr: -0.036957934 hartree
energy: -1510.102431382809
dipole: -17.55972 16.98918 -0.57054 10.95935 -11.42181 -0.46246 -2.83441 2.19042 -0.64399
magnitude: 0.97679 au
magnitude: 2.48279 debye
