program: Orca
programVersion: 5.0.2
elementType: Si F O O C C C C C C C C C C C C C C C C C C C C C C C C C H H H H H H H H H H H H H H H H H H H H H H H H H H H H H
charge: 0
multiplicity: 1
keywords: wb97x-d3
keywords: def2-TZVPP
keywords: def2/J RIJCOSX
keywords: DEFGRID2
keywords: scfconv7
keywords: smallprint printgap noloewdin
keywords: NOSOSCF
formula: C25H29FO2Si
InChI: InChI=1/C25H29FO2Si/c1-4-27-21-13-15-23(16-14-21)29(2,3)18-8-9-20-12-17-24(26)25(19-20)28-22-10-6-5-7-11-22/h5-7,10-17,19H,4,8-9,18H2,1-3H3
58 atoms
Si -3.973181 0.988682 1.030351
F  1.851299 -2.751752 0.980752
O  1.887708 2.492033 1.038997
O  1.756443 -0.580218 -0.703981
C  -3.968789 -0.625899 0.049032
C  -3.483975 -0.45651 -1.39446
C  -2.179328 1.557577 1.094043
C  -4.611197 0.664457 2.771877
C  -5.022169 2.294167 0.174109
C  -2.812814 -1.707561 -1.976829
C  -1.197354 0.744973 1.676048
C  -1.738439 2.737977 0.500626
C  -1.545572 -2.048088 -1.242529
C  0.141065 1.087312 1.662535
C  -0.396237 3.104255 0.470761
C  0.558288 2.269044 1.044798
C  -0.426183 -1.225351 -1.366473
C  -1.475296 -3.134682 -0.378273
C  0.719683 -1.46173 -0.62873
C  -0.329392 -3.387707 0.366013
C  0.749024 -2.541584 0.246242
C  2.413214 3.67843 0.456161
C  2.296201 4.880132 1.36871
C  3.010791 -1.026161 -1.020243
C  4.072298 -0.267709 -0.544183
C  3.236884 -2.147993 -1.806588
C  5.370133 -0.640367 -0.85642
C  4.54348 -2.512106 -2.103799
C  5.614302 -1.766199 -1.632302
H  -3.312118 -1.312673 0.595846
H  -4.956537 -1.097025 0.065113
H  -2.770644 0.371089 -1.473005
H  -4.326859 -0.177925 -2.031657
H  -3.9989 -0.074991 3.293048
H  -4.611093 1.572589 3.378335
H  -5.634597 0.282144 2.755908
H  -6.061979 1.965602 0.105973
H  -5.021182 3.242576 0.715455
H  -4.682662 2.49598 -0.84385
H  -3.50415 -2.552708 -1.933066
H  -2.592883 -1.53456 -3.033885
H  -1.474953 -0.190667 2.151097
H  -2.450821 3.4119 0.038079
H  0.878711 0.434244 2.113684
H  -0.123285 4.033966 -0.010227
H  -0.44549 -0.370012 -2.032661
H  -2.328021 -3.793388 -0.271146
H  -0.28163 -4.22766 1.047492
H  1.953276 3.86951 -0.518034
H  3.464286 3.457016 0.26936
H  2.804362 4.702059 2.317113
H  2.76992 5.740345 0.893697
H  1.261564 5.150096 1.581849
H  3.877688 0.602532 0.070074
H  2.413744 -2.735343 -2.194911
H  6.195615 -0.049327 -0.480956
H  4.719679 -3.388265 -2.714566
H  6.629296 -2.058672 -1.866634
elementType: Si F O C H
totalener: -1510.06834661 hartree
nucrepener: 2966.54628428 hartree
electener: -4476.61463089 hartree
oneelecener: -7964.59102123 hartree
twoeener: 3487.97639033 hartree
cpcmener: -0.02425420 hartree
kineticenergy: 1503.90559225 hartree
xcener: -135.230030912742 hartree
chargesum: 0.0000000
charge: 0.487921 -0.219435 -0.338938 -0.319965 -0.270291 -0.126461 -0.177663 -0.429720 -0.441740 -0.095842 -0.115748 -0.137481 0.044879 -0.307177 -0.234860 0.370632 -0.238081 -0.191605 0.140315 -0.154917 0.261127 0.048636 -0.258128 0.278026 -0.247079 -0.174689 -0.136718 -0.163620 -0.178935 0.074652 0.093389 0.070063 0.092965 0.099879 0.102598 0.101514 0.109121 0.107796 0.103481 0.083828 0.097472 0.131244 0.142024 0.130740 0.137603 0.131624 0.144261 0.147105 0.086945 0.100674 0.088157 0.092503 0.090263 0.144201 0.152969 0.156373 0.157824 0.156289
qa: 0.4879 -0.2194 -0.3389 -0.3200 -0.2703 -0.1265 -0.1777 -0.4297 -0.4417 -0.0958 -0.1157 -0.1375 0.0449 -0.3072 -0.2349 0.3706 -0.2381 -0.1916 0.1403 -0.1549 0.2611 0.0486 -0.2581 0.2780 -0.2471 -0.1747 -0.1367 -0.1636 -0.1789 0.0747 0.0934 0.0701 0.0930 0.0999 0.1026 0.1015 0.1091 0.1078 0.1035 0.0838 0.0975 0.1312 0.1420 0.1307 0.1376 0.1316 0.1443 0.1471 0.0869 0.1007 0.0882 0.0925 0.0903 0.1442 0.1530 0.1564 0.1578 0.1563
va: 4.1390 1.0620 2.0583 2.0248 3.8400 3.8644 3.7450 3.8984 3.9185 3.8602 3.8300 3.8757 3.6123 3.9999 3.9212 3.6897 3.9292 3.8645 3.6266 3.9094 3.9543 3.8564 3.9244 3.7103 3.9735 3.8944 3.9197 3.9216 3.8985 1.0163 1.0140 1.0054 1.0070 1.0098 1.0088 1.0099 1.0090 1.0081 1.0062 1.0075 1.0057 0.9920 0.9893 1.0177 1.0072 1.0179 1.0016 0.9991 0.9961 0.9891 1.0056 1.0086 1.0028 1.0172 1.0009 0.9914 0.9909 0.9905
dispcorr: -0.033092688 hartree
energy: -1510.101439299615
dipole: -21.87602 21.19441 -0.68160 19.14066 -18.76671 0.37395 -0.25831 -0.62854 -0.88685
magnitude: 1.17937 au
magnitude: 2.99773 debye
