program: Orca
programVersion: 5.0.2
elementType: Si F O O C C C C C C C C C C C C C C C C C C C C C C C C C H H H H H H H H H H H H H H H H H H H H H H H H H H H H H
charge: 0
multiplicity: 1
keywords: wb97x-d3
keywords: def2-TZVPP
keywords: def2/J RIJCOSX
keywords: DEFGRID2
keywords: scfconv7
keywords: smallprint printgap noloewdin
keywords: NOSOSCF
formula: C25H29FO2Si
InChI: InChI=1/C25H29FO2Si/c1-4-27-21-13-15-23(16-14-21)29(2,3)18-8-9-20-12-17-24(26)25(19-20)28-22-10-6-5-7-11-22/h5-7,10-17,19H,4,8-9,18H2,1-3H3
58 atoms
Si -4.173288 1.277087 1.141099
F  2.101182 -3.7521 -2.138166
O  1.499822 3.379332 1.206898
O  1.994045 -1.041871 -1.868932
C  -4.060773 -0.581113 1.52942
C  -2.814003 -1.304396 1.019182
C  -2.434046 1.99438 1.1184
C  -5.174429 2.109602 2.502563
C  -5.018667 1.598512 -0.510596
C  -2.692856 -1.316092 -0.505116
C  -1.664157 2.040208 2.287429
C  -1.821856 2.443005 -0.050025
C  -1.425256 -1.977678 -0.965465
C  -0.361209 2.500598 2.288671
C  -0.511046 2.907829 -0.075925
C  0.231904 2.937408 1.101563
C  -0.276748 -1.217588 -1.176344
C  -1.352138 -3.355839 -1.143709
C  0.906616 -1.812943 -1.576552
C  -0.16737 -3.967827 -1.531891
C  0.948315 -3.189587 -1.749061
C  2.256623 3.674965 0.038867
C  2.74779 2.4309 -0.669851
C  3.132492 -1.169082 -1.121286
C  4.304836 -0.711154 -1.709713
C  3.140412 -1.679973 0.169366
C  5.492677 -0.767289 -0.998521
C  4.340864 -1.734025 0.866512
C  5.51942 -1.282111 0.291745
H  -4.10855 -0.689447 2.618434
H  -4.96261 -1.076264 1.150713
H  -2.81325 -2.338912 1.377654
H  -1.918895 -0.839388 1.442449
H  -5.294384 3.178407 2.312889
H  -6.175612 1.678329 2.578849
H  -4.703107 2.002136 3.481951
H  -4.486615 1.166853 -1.360307
H  -6.022738 1.16713 -0.511673
H  -5.130015 2.66814 -0.702007
H  -3.558816 -1.828428 -0.933236
H  -2.7165 -0.2926 -0.887093
H  -2.084238 1.704472 3.22988
H  -2.367842 2.433451 -0.986875
H  0.211874 2.523361 3.208004
H  -0.094728 3.237586 -1.018466
H  -0.302251 -0.141517 -1.042099
H  -2.232285 -3.967285 -0.986599
H  -0.1148 -5.039408 -1.676946
H  3.106083 4.255356 0.399547
H  1.694817 4.325951 -0.637784
H  3.327536 1.801128 0.005899
H  1.936539 1.833087 -1.085684
H  3.398768 2.720227 -1.496064
H  4.281739 -0.313953 -2.716927
H  2.23019 -2.026422 0.64284
H  6.404143 -0.410864 -1.461113
H  4.346256 -2.132674 1.872917
H  6.449272 -1.329054 0.842895
elementType: Si F O C H
totalener: -1510.06868535 hartree
nucrepener: 2911.02264576 hartree
electener: -4421.09133111 hartree
oneelecener: -7852.32604482 hartree
twoeener: 3431.23471371 hartree
cpcmener: -0.02279711 hartree
kineticenergy: 1503.90717286 hartree
xcener: -135.229297194144 hartree
chargesum: -0.0000000
charge: 0.476103 -0.217394 -0.336212 -0.324560 -0.277390 -0.125856 -0.125405 -0.455679 -0.427994 -0.071906 -0.133610 -0.169731 -0.011264 -0.266560 -0.243681 0.340935 -0.169427 -0.172109 0.101051 -0.190767 0.277313 0.045785 -0.246224 0.254784 -0.257704 -0.153357 -0.106179 -0.163432 -0.182369 0.097890 0.085331 0.093481 0.078029 0.100654 0.101181 0.098270 0.101774 0.108733 0.109404 0.098703 0.069301 0.133270 0.145909 0.132856 0.139993 0.134313 0.142210 0.146848 0.108432 0.088071 0.077953 0.076235 0.096277 0.143001 0.153163 0.156160 0.158221 0.157178
qa: 0.4761 -0.2174 -0.3362 -0.3246 -0.2774 -0.1259 -0.1254 -0.4557 -0.4280 -0.0719 -0.1336 -0.1697 -0.0113 -0.2666 -0.2437 0.3409 -0.1694 -0.1721 0.1011 -0.1908 0.2773 0.0458 -0.2462 0.2548 -0.2577 -0.1534 -0.1062 -0.1634 -0.1824 0.0979 0.0853 0.0935 0.0780 0.1007 0.1012 0.0983 0.1018 0.1087 0.1094 0.0987 0.0693 0.1333 0.1459 0.1329 0.1400 0.1343 0.1422 0.1468 0.1084 0.0881 0.0780 0.0762 0.0963 0.1430 0.1532 0.1562 0.1582 0.1572
va: 4.0915 1.0685 2.0762 2.0479 3.8460 3.8618 3.6935 3.9040 3.8936 3.7514 3.8886 3.8333 3.6841 4.0390 3.8440 3.7298 3.9160 3.8972 3.8302 3.9435 3.9703 3.8984 3.9013 3.6109 3.9548 3.8653 3.8765 3.9247 3.8977 1.0086 1.0137 1.0095 1.0097 1.0110 1.0107 1.0130 1.0099 1.0107 1.0074 1.0103 1.0202 0.9927 0.9883 1.0140 1.0067 1.0080 1.0012 0.9998 0.9915 0.9953 1.0039 1.0030 1.0089 1.0112 1.0030 0.9887 0.9909 0.9903
dispcorr: -0.032175445 hartree
energy: -1510.100860793550
dipole: -21.74196 21.12016 -0.62180 16.87695 -16.83618 0.04077 10.26990 -10.28006 -0.01016
magnitude: 0.62321 au
magnitude: 1.58409 debye
