program: Gaussian 09
title: 000063577
version: EM64L-G09RevD.01
frameworkgroup: C1[X(C16H15N3O2)]
method: RPBEPBE
basis: SDD
operation: Freq
keyword: #p
keyword: freq=noraman
keyword: PBEPBE/SDD
title: #p freq=noraman PBEPBE/SDD
converged: YES YES NO NO
title: Mulliken charges:
elementType: O O N N N C C C C C C C C C C C C C C C C H H H H H H H H H H H H H H H
charge: -0.318984 -0.272656 -0.174472 -0.429197 -0.027131 -0.385293 0.139629 0.190587 0.050471 0.308295 -0.262749 -0.328056 0.186717 -0.332433 -0.322113 -0.241823 -0.205282 -0.322313 -0.248166 -0.258678 -0.528592 0.272050 0.268346 0.335668 0.280731 0.270007 0.260036 0.246428 0.233068 0.232914 0.237949 0.225554 0.225783 0.226111 0.225749 0.241845
chargesum: 0.00000
title: Mulliken charges with hydrogens summed into heavy atoms:
elementType: O O N N N C C C C C C C C C C C C C C C C
charge: -0.318984 -0.272656 -0.174472 -0.093529 -0.027131 0.155103 0.139629 0.190587 0.050471 0.308295 0.017982 -0.058048 0.186717 -0.072398 -0.075685 -0.008755 0.027633 -0.084365 -0.022612 -0.032895 0.165113
polarizability: 2.94392145e+02 -5.32689380e+00 1.65240871e+02 1.38371769e+01 6.85229883e+00 1.57563372e+02
1716.lowfreq: -10.9795 -4.2125 -0.0004 0.0006 0.0007 2.0940 10.5706 25.7245 32.3988
frequency: 9.9917 25.6579 32.3617 78.7661 94.0436 130.5705 136.1598 146.2810 196.8484 211.6808 230.2551 246.5725 267.3980 278.0861 295.2674 324.0852 406.2456 426.9246 448.9194 468.0516 471.2812 484.8551 497.4799 541.4055 547.8625 562.1667 569.1221 580.5670 597.2896 635.9638 686.7464 712.0240 723.5843 733.0875 739.2310 741.0254 784.7674 793.8748 801.0238 831.6782 840.4910 895.7194 903.3138 924.5227 927.0516 959.2354 980.3216 993.8597 1003.3570 1020.5985 1023.8162 1052.3690 1077.5910 1095.6503 1117.3160 1120.3341 1147.9777 1154.7098 1160.8293 1174.4375 1187.6742 1201.7147 1226.8510 1246.8211 1257.9520 1280.3964 1284.5742 1321.6692 1357.7498 1389.7648 1399.2817 1408.2798 1430.5923 1448.1453 1450.2060 1455.9074 1465.6626 1466.5520 1470.0517 1480.5654 1518.2968 1544.3201 1559.0975 1600.3700 1604.3083 1618.2172 1618.8427 2964.3233 3013.9696 3053.2536 3076.3124 3125.4462 3134.0522 3134.1706 3145.1560 3148.2765 3157.8167 3163.7158 3170.3865 3172.9512 3173.8089 3566.4594
redmass: 5.3284 4.6351 5.5549 6.4014 3.3210 4.9091 4.1220 5.0652 3.1390 2.0585 2.9268 3.7987 3.3291 2.7995 6.7191 4.0417 4.5198 3.0487 3.1778 5.5908 3.6464 6.3175 8.4181 6.1286 1.1918 4.1265 4.5466 4.9683 3.4774 5.8293 4.2872 6.1342 4.0540 4.4865 5.0549 1.2936 1.5337 3.4462 4.9538 1.4506 5.8472 1.4844 1.3811 6.7420 1.4005 1.2971 1.3741 8.3619 1.3316 2.1928 2.0961 1.8010 3.6183 2.9136 1.2584 2.2236 1.6977 1.5764 1.4540 1.0724 2.0107 2.7939 2.5429 2.6267 1.2984 1.6035 1.5976 1.8304 1.5199 2.9985 4.1655 2.0976 1.4832 2.4049 1.8811 2.6645 1.0849 1.3389 1.1825 1.2196 2.8853 6.6462 7.2222 10.1913 5.7887 6.6315 6.5145 1.0325 1.0613 1.1042 1.1044 1.0999 1.0861 1.0851 1.0894 1.0900 1.0938 1.0957 1.0922 1.1001 1.0996 1.0771
irintensity: 0.0798 0.8764 0.4363 3.8662 5.3206 1.5382 3.2292 1.9952 3.9245 1.4822 1.2263 0.2528 2.9976 1.1636 8.0734 1.4182 11.1349 5.6078 8.5803 2.5633 2.0742 6.3714 4.9800 6.2308 88.2264 0.0511 9.1548 4.4825 2.8450 6.3029 24.5899 9.0175 0.4212 14.8994 26.2517 133.3100 72.9429 2.3318 2.4785 0.6622 12.3896 0.0234 4.6863 0.4190 11.9110 0.1963 3.4401 63.2335 0.0133 21.0744 6.3664 12.5320 53.2282 20.3309 0.0999 125.8945 55.6242 35.6914 70.1321 1.9145 42.9484 160.7750 34.1841 115.4685 20.3268 27.0797 19.4597 50.5574 12.5513 65.2475 26.2471 26.8642 12.3096 4.5054 39.4607 39.9196 19.3423 65.5932 27.0907 8.1404 267.2194 98.6391 26.8779 371.4727 21.9990 68.8813 61.4142 72.0041 11.8954 43.7725 8.0321 21.3903 5.1255 4.3765 13.5268 6.8757 29.1092 14.0421 1.2582 14.0293 22.1380 67.1613
temp: 298.150 k
press: 1.00000 atm
elementType: 8 8 7 7 7 6 6 6 6 6 6 6 6 6 6 6 6 6 6 6 6 1 1 1 1 1 1 1 1 1 1 1 1 1 1 1
symmnumber: 1
zpe: 739033.0 jmol-1
zpe.correction: 0.281483 hartree
zpe.thermalcorrener: 0.299240 hartree
zpe.thermalcorrenthalpy: 0.300184 hartree
zpe.thermalcorrgfe: 0.233423 hartree
zpe.sumelectzpe: -931.929381 hartree
zpe.sumelectthermal: -931.911624 hartree
zpe.sumelectthermalent: -931.910680 hartree
zpe.sumelectthermalfe: -931.977441 hartree
dipole: 3.1781 -0.1856 1.7975
dipole: 3.6559
quadrupole: -89.1915 -122.2300 -126.3184
quadrupole: -7.9514 6.6802 -8.2573
quadrupole: 23.3884 -9.6500 -13.7384 -7.9514 6.6802 -8.2573
hfenergy: -932.2108638 hartree
pointgroup: C01 [X(C16H15N3O2)]
dipole: -1.111034 -0.7957849 -0.448471 debye
polarizability: 284.3731232|37.9922928|163.6517414|9.3338099|-0.7254626|169.1715237 unknown
InChI: InChI=1S/C16H15N3O2/c1-21-15-9-5-4-8-14(15)18-11-19-10-17-13-7-3-2-6-12(13)16(19)20/h2-10,18H,11H2,1H3
charge 0 multiplicity 1
36 atoms
O  -3.647743 -2.307116 0.04902
O  1.984633 0.388182 2.721841
N  0.906646 -0.380044 0.793057
N  -1.440035 -1.161034 0.942091
N  1.933302 -0.39963 -1.38903
C  -0.296007 -0.70154 1.670402
C  3.179509 0.463525 0.587979
C  2.03185 0.181001 1.468347
C  3.092591 0.160853 -0.812047
C  -2.397019 -0.308412 0.359609
C  0.916725 -0.63755 -0.575697
C  4.366752 1.027673 1.124691
C  -3.602167 -0.90566 -0.128623
C  4.209418 0.43395 -1.650544
C  -2.231563 1.090607 0.225673
C  5.459523 1.291793 0.283594
C  5.377349 0.992697 -1.107151
C  -4.611922 -0.124301 -0.718418
C  -3.25058 1.877909 -0.361871
C  -4.436106 1.278443 -0.832708
C  -4.849316 -3.007508 -0.404429
H  0.034898 -1.466585 2.392848
H  -0.505777 0.217999 2.245935
H  -1.688146 -2.150361 0.963414
H  -0.004647 -1.068685 -0.975888
H  4.398288 1.244989 2.197507
H  4.122438 0.196098 -2.714922
H  -1.307017 1.568021 0.566782
H  6.376318 1.727893 0.694205
H  6.23377 1.201071 -1.75801
H  -5.531841 -0.588094 -1.087399
H  -3.105668 2.959146 -0.456459
H  -5.221599 1.887047 -1.291945
H  -4.993261 -2.886365 -1.495326
H  -5.74724 -2.64492 0.132066
H  -4.677056 -4.067791 -0.167596
