program: Orca
programVersion: 5.0.2
elementType: Si F O O C C C C C C C C C C C C C C C C C C C C C C C C C H H H H H H H H H H H H H H H H H H H H H H H H H H H H H
charge: 0
multiplicity: 1
keywords: wb97x-d3
keywords: def2-TZVPP
keywords: def2/J RIJCOSX
keywords: DEFGRID2
keywords: scfconv7
keywords: smallprint printgap noloewdin
keywords: NOSOSCF
formula: C25H29FO2Si
InChI: InChI=1/C25H29FO2Si/c1-4-27-21-13-15-23(16-14-21)29(2,3)18-8-9-20-12-17-24(26)25(19-20)28-22-10-6-5-7-11-22/h5-7,10-17,19H,4,8-9,18H2,1-3H3
58 atoms
Si -4.063404 0.938083 0.912475
F  1.254721 -0.83327 -3.088738
O  1.715773 2.719736 0.867242
O  1.795978 -0.457423 -0.41187
C  -3.885654 -0.88456 0.44537
C  -3.018894 -1.680215 1.426295
C  -2.308477 1.615942 0.944898
C  -4.862725 1.130115 2.604451
C  -5.07057 1.836415 -0.399336
C  -2.276104 -2.860506 0.786564
C  -1.634679 1.900808 2.130122
C  -1.571692 1.737959 -0.240046
C  -1.29425 -2.399324 -0.254694
C  -0.295472 2.275358 2.155876
C  -0.241028 2.111237 -0.241113
C  0.415927 2.372891 0.963228
C  -0.138719 -1.715707 0.123663
C  -1.543307 -2.577288 -1.611043
C  0.728818 -1.198141 -0.822483
C  -0.680854 -2.065504 -2.572462
C  0.434194 -1.366188 -2.171204
C  2.516639 2.798716 2.041097
C  2.869806 1.442422 2.614535
C  3.049127 -0.743718 -0.883225
C  3.925842 0.325876 -1.005749
C  3.457269 -2.035185 -1.187311
C  5.221758 0.098111 -1.442751
C  4.755969 -2.245426 -1.63181
C  5.642176 -1.18572 -1.76419
H  -4.863631 -1.3616 0.32745
H  -3.436786 -0.891925 -0.554726
H  -3.641442 -2.055613 2.242247
H  -2.271375 -1.035917 1.900979
H  -4.940859 2.17754 2.903692
H  -5.8762 0.721857 2.595795
H  -4.313711 0.60502 3.388703
H  -6.088705 1.444807 -0.458848
H  -5.144047 2.905307 -0.187977
H  -4.627488 1.730478 -1.392156
H  -1.754531 -3.418199 1.569268
H  -2.994607 -3.54878 0.334519
H  -2.152596 1.827455 3.080022
H  -2.037925 1.525399 -1.196596
H  0.169161 2.475756 3.112122
H  0.306013 2.187821 -1.173347
H  0.087894 -1.560516 1.172755
H  -2.428995 -3.11245 -1.929935
H  -0.885291 -2.191379 -3.628139
H  2.039804 3.434561 2.793265
H  3.423317 3.31426 1.724154
H  3.496858 1.581287 3.496562
H  1.993913 0.871206 2.923113
H  3.434332 0.843349 1.899476
H  3.590961 1.326828 -0.764315
H  2.781382 -2.874684 -1.077978
H  5.902085 0.934346 -1.540957
H  5.073688 -3.251529 -1.873883
H  6.651311 -1.358294 -2.114449
elementType: Si F O C H
totalener: -1510.06764280 hartree
nucrepener: 3005.31054176 hartree
electener: -4515.37818456 hartree
oneelecener: -8042.07045683 hartree
twoeener: 3526.69227226 hartree
cpcmener: -0.02364757 hartree
kineticenergy: 1503.91087678 hartree
xcener: -135.232289720090 hartree
chargesum: 0.0000000
charge: 0.495085 -0.219075 -0.339627 -0.314769 -0.266103 -0.127815 -0.169554 -0.439613 -0.436404 -0.096886 -0.129302 -0.116877 0.056296 -0.251271 -0.283507 0.344094 -0.265878 -0.198145 0.145607 -0.152703 0.263174 0.030985 -0.273057 0.306756 -0.290301 -0.184138 -0.116708 -0.154327 -0.185629 0.092991 0.075878 0.092952 0.069021 0.109163 0.108059 0.100994 0.102222 0.103267 0.099089 0.097088 0.083637 0.142291 0.131018 0.138926 0.131502 0.134817 0.144633 0.146463 0.097491 0.112074 0.102477 0.092690 0.088899 0.146782 0.154314 0.156996 0.157374 0.156584
qa: 0.4951 -0.2191 -0.3396 -0.3148 -0.2661 -0.1278 -0.1696 -0.4396 -0.4364 -0.0969 -0.1293 -0.1169 0.0563 -0.2513 -0.2835 0.3441 -0.2659 -0.1981 0.1456 -0.1527 0.2632 0.0310 -0.2731 0.3068 -0.2903 -0.1841 -0.1167 -0.1543 -0.1856 0.0930 0.0759 0.0930 0.0690 0.1092 0.1081 0.1010 0.1022 0.1033 0.0991 0.0971 0.0836 0.1423 0.1310 0.1389 0.1315 0.1348 0.1446 0.1465 0.0975 0.1121 0.1025 0.0927 0.0889 0.1468 0.1543 0.1570 0.1574 0.1566
va: 4.1379 1.0625 2.0516 2.0185 3.8416 3.8695 3.7328 3.9145 3.8998 3.8600 3.8517 3.8384 3.6071 3.9038 3.9719 3.7162 3.9335 3.8652 3.6294 3.9170 3.9563 3.8374 3.9228 3.6416 3.9681 3.9185 3.9015 3.9138 3.9092 1.0128 1.0142 1.0075 1.0073 1.0080 1.0091 1.0073 1.0103 1.0089 1.0109 1.0057 1.0075 0.9896 0.9933 1.0034 1.0149 1.0143 1.0013 0.9992 0.9975 0.9913 1.0125 1.0015 0.9995 1.0230 1.0001 0.9909 0.9907 0.9905
dispcorr: -0.034917583 hartree
energy: -1510.102560383726
dipole: -18.09009 17.78803 -0.30205 3.14190 -3.94564 -0.80374 19.81198 -18.77788 1.03411
magnitude: 1.34410 au
magnitude: 3.41643 debye
