program: Orca
programVersion: 5.0.2
elementType: Si F O O C C C C C C C C C C C C C C C C C C C C C C C C C H H H H H H H H H H H H H H H H H H H H H H H H H H H H H
charge: 0
multiplicity: 1
keywords: wb97x-d3
keywords: def2-TZVPP
keywords: def2/J RIJCOSX
keywords: DEFGRID2
keywords: scfconv7
keywords: smallprint printgap noloewdin
keywords: NOSOSCF
formula: C25H29FO2Si
InChI: InChI=1/C25H29FO2Si/c1-4-27-21-13-15-23(16-14-21)29(2,3)18-8-9-20-12-17-24(26)25(19-20)28-22-10-6-5-7-11-22/h5-7,10-17,19H,4,8-9,18H2,1-3H3
58 atoms
Si -3.434468 1.437568 -0.316779
F  2.411731 -2.532964 0.666678
O  1.935362 2.638885 2.227216
O  1.570335 -2.208863 -1.911921
C  -3.350523 -0.3052 -1.054716
C  -3.735067 -1.450195 -0.111499
C  -1.775658 1.801527 0.505021
C  -4.819421 1.556129 0.955266
C  -3.729077 2.691187 -1.688546
C  -3.086316 -2.792727 -0.476519
C  -1.15067 0.862873 1.328223
C  -1.089574 3.00316 0.300039
C  -1.609977 -2.783586 -0.193927
C  0.086469 1.087913 1.919269
C  0.140303 3.254533 0.88272
C  0.743888 2.297011 1.700162
C  -0.680816 -2.512266 -1.194995
C  -1.14703 -2.965778 1.107613
C  0.671797 -2.423169 -0.90721
C  0.204073 -2.881737 1.410164
C  1.100083 -2.611952 0.398549
C  2.625412 1.743929 3.091506
C  3.406746 0.684994 2.345931
C  2.328228 -1.067308 -1.884882
C  1.886772 0.115215 -1.305486
C  3.567946 -1.133619 -2.507584
C  2.711591 1.232685 -1.341474
C  4.375697 -0.007713 -2.540018
C  3.956236 1.178827 -1.951917
H  -3.975402 -0.352937 -1.952351
H  -2.323697 -0.430323 -1.415004
H  -4.821538 -1.567695 -0.116925
H  -3.474843 -1.225439 0.927276
H  -4.891321 2.565832 1.365678
H  -5.790436 1.313403 0.516906
H  -4.661662 0.877486 1.796341
H  -2.951873 2.651915 -2.45476
H  -4.682048 2.493817 -2.185271
H  -3.771757 3.716265 -1.314659
H  -3.56051 -3.588073 0.104024
H  -3.269912 -3.017701 -1.530105
H  -1.624959 -0.092022 1.525126
H  -1.517422 3.774246 -0.330726
H  0.515596 0.310365 2.53719
H  0.645359 4.197124 0.707101
H  -1.003768 -2.371268 -2.219887
H  -1.850407 -3.17841 1.903538
H  0.560821 -3.03379 2.421024
H  1.938542 1.29457 3.814928
H  3.309695 2.376258 3.658108
H  2.769168 0.000791 1.786912
H  4.116266 1.135926 1.651278
H  3.976144 0.090965 3.062468
H  0.914352 0.181123 -0.832085
H  3.895998 -2.062329 -2.957722
H  2.369386 2.153383 -0.886355
H  5.343766 -0.063866 -3.021071
H  4.592525 2.053715 -1.972076
elementType: Si F O C H
totalener: -1510.06636266 hartree
nucrepener: 3025.97493940 hartree
electener: -4536.04130206 hartree
oneelecener: -8082.28961471 hartree
twoeener: 3546.24831265 hartree
cpcmener: -0.02248876 hartree
kineticenergy: 1503.89871429 hartree
xcener: -135.230036811359 hartree
chargesum: 0.0000000
charge: 0.496655 -0.219101 -0.330176 -0.334597 -0.285405 -0.151276 -0.167597 -0.410471 -0.460576 -0.081544 -0.175755 -0.073680 0.098142 -0.235685 -0.295852 0.315297 -0.281144 -0.247593 0.229787 -0.165433 0.222481 0.042060 -0.242207 0.247473 -0.137121 -0.211119 -0.203343 -0.135973 -0.163560 0.096826 0.088820 0.093427 0.075882 0.106793 0.104456 0.100617 0.107935 0.105726 0.098759 0.096778 0.085469 0.156877 0.139138 0.138989 0.131074 0.138939 0.140909 0.149465 0.085663 0.107852 0.057911 0.086561 0.103665 0.135559 0.143087 0.167778 0.156081 0.156280
qa: 0.4967 -0.2191 -0.3302 -0.3346 -0.2854 -0.1513 -0.1676 -0.4105 -0.4606 -0.0815 -0.1758 -0.0737 0.0981 -0.2357 -0.2959 0.3153 -0.2811 -0.2476 0.2298 -0.1654 0.2225 0.0421 -0.2422 0.2475 -0.1371 -0.2111 -0.2033 -0.1360 -0.1636 0.0968 0.0888 0.0934 0.0759 0.1068 0.1045 0.1006 0.1079 0.1057 0.0988 0.0968 0.0855 0.1569 0.1391 0.1390 0.1311 0.1389 0.1409 0.1495 0.0857 0.1079 0.0579 0.0866 0.1037 0.1356 0.1431 0.1678 0.1561 0.1563
va: 4.1028 1.0650 2.0626 2.0727 3.8169 3.9109 3.7656 3.8764 3.9227 3.8331 3.8337 3.8201 3.5141 3.8474 4.0041 3.7116 4.0020 3.8897 3.6950 3.8603 3.9533 3.8716 3.9137 3.7199 3.7868 3.9773 3.8755 3.9142 3.8919 1.0091 1.0101 1.0083 0.9964 1.0104 1.0071 1.0095 1.0085 1.0123 1.0112 1.0055 1.0095 0.9675 0.9862 1.0067 1.0160 1.0138 1.0034 0.9977 0.9966 0.9907 0.9994 1.0073 1.0136 1.0104 1.0097 0.9879 0.9885 0.9913
dispcorr: -0.036199248 hartree
energy: -1510.102561908137
dipole: -20.38614 19.54108 -0.84506 12.33862 -12.67126 -0.33264 3.78387 -3.06382 0.72005
magnitude: 1.15899 au
magnitude: 2.94591 debye
