program: Orca
programVersion: 5.0.2
elementType: Si F O O C C C C C C C C C C C C C C C C C C C C C C C C C H H H H H H H H H H H H H H H H H H H H H H H H H H H H H
charge: 0
multiplicity: 1
keywords: wb97x-d3
keywords: def2-TZVPP
keywords: def2/J RIJCOSX
keywords: DEFGRID2
keywords: scfconv7
keywords: smallprint printgap noloewdin
keywords: NOSOSCF
formula: C25H29FO2Si
InChI: InChI=1/C25H29FO2Si/c1-4-27-21-13-15-23(16-14-21)29(2,3)18-8-9-20-12-17-24(26)25(19-20)28-22-10-6-5-7-11-22/h5-7,10-17,19H,4,8-9,18H2,1-3H3
58 atoms
Si -3.915089 1.202575 0.469575
F  1.456137 -3.30555 -1.955433
O  1.807757 2.94828 -0.341756
O  1.536318 -0.683093 -1.214934
C  -3.977724 -0.686072 0.283982
C  -3.610402 -1.515239 1.515477
C  -2.166388 1.847419 0.255018
C  -4.561888 1.698553 2.170103
C  -5.004505 1.945101 -0.878234
C  -2.141871 -1.427555 1.939157
C  -1.527748 1.768996 -0.988432
C  -1.415487 2.354314 1.31017
C  -1.178089 -1.931541 0.897593
C  -0.212696 2.145692 -1.162337
C  -0.08697 2.737205 1.162137
C  0.531106 2.622054 -0.080329
C  -0.220733 -1.089045 0.3440
C  -1.220918 -3.25441 0.465239
C  0.657442 -1.542482 -0.627084
C  -0.339613 -3.726107 -0.49509
C  0.594227 -2.865644 -1.035999
C  2.668305 3.341178 0.709512
C  3.132157 2.184588 1.575094
C  2.840628 -0.687557 -0.83144
C  3.69083 0.138511 -1.558279
C  3.329836 -1.437517 0.229196
C  5.031853 0.201881 -1.226119
C  4.678472 -1.360075 0.55076
C  5.536546 -0.546222 -0.169657
H  -5.001441 -0.939254 -0.012066
H  -3.351544 -0.982222 -0.564298
H  -3.861362 -2.564904 1.332932
H  -4.229617 -1.212582 2.364847
H  -4.5792 2.782736 2.288764
H  -5.581486 1.339553 2.319118
H  -3.957768 1.289829 2.982192
H  -4.991188 3.035067 -0.843813
H  -4.670794 1.64892 -1.874282
H  -6.042123 1.622031 -0.778019
H  -1.887066 -0.396055 2.193689
H  -2.012047 -2.00575 2.858998
H  -2.064316 1.385868 -1.849489
H  -1.859642 2.45128 2.294433
H  0.264651 2.057067 -2.129052
H  0.444139 3.115297 2.024827
H  -0.153923 -0.056328 0.660562
H  -1.951124 -3.935739 0.884617
H  -0.371724 -4.755324 -0.826664
H  2.204799 4.128515 1.315095
H  3.525982 3.793848 0.211496
H  3.813951 2.555066 2.341615
H  2.308479 1.680727 2.079739
H  3.665429 1.443081 0.983019
H  3.29116 0.726809 -2.373108
H  2.67566 -2.073899 0.809964
H  5.688524 0.845609 -1.796365
H  5.055451 -1.948231 1.377057
H  6.585855 -0.494584 0.086159
totalener: -1510.04722840 hartree
nucrepener: 3025.61797798 hartree
electener: -4535.66520638 hartree
oneelecener: -8080.83665701 hartree
twoeener: 3545.17145063 hartree
kineticenergy: 1503.97276780 hartree
xcener: -135.247630791800 hartree
chargesum: -0.0000000
charge: 0.433573 -0.194526 -0.289838 -0.287626 -0.243741 -0.161163 -0.109577 -0.417752 -0.412442 -0.125953 -0.050638 -0.165165 -0.045985 -0.260707 -0.195854 0.329925 -0.061385 -0.090755 0.062132 -0.199945 0.270858 0.016179 -0.225411 0.303544 -0.233551 -0.151650 -0.085115 -0.132146 -0.153671 0.090518 0.083254 0.086229 0.083061 0.109727 0.104796 0.086430 0.097415 0.089273 0.091315 0.075248 0.099934 0.099645 0.116228 0.106510 0.103847 0.108322 0.110658 0.120334 0.081395 0.101315 0.089613 0.084019 0.064784 0.111720 0.117045 0.121458 0.122808 0.121484
qa: 0.4336 -0.1945 -0.2898 -0.2876 -0.2437 -0.1612 -0.1096 -0.4178 -0.4124 -0.1260 -0.0506 -0.1652 -0.0460 -0.2607 -0.1959 0.3299 -0.0614 -0.0908 0.0621 -0.1999 0.2709 0.0162 -0.2254 0.3035 -0.2336 -0.1517 -0.0851 -0.1321 -0.1537 0.0905 0.0833 0.0862 0.0831 0.1097 0.1048 0.0864 0.0974 0.0893 0.0913 0.0752 0.0999 0.0996 0.1162 0.1065 0.1038 0.1083 0.1107 0.1203 0.0814 0.1013 0.0896 0.0840 0.0648 0.1117 0.1170 0.1215 0.1228 0.1215
va: 4.1616 1.1041 2.1030 2.1000 3.8181 3.9004 3.6995 3.9091 3.9081 3.8274 3.8665 3.9377 3.7164 4.0211 3.9048 3.7806 3.8415 3.8698 3.8112 3.9859 4.0435 3.8805 3.9176 3.7255 3.9872 3.9089 3.9043 3.9652 3.9400 1.0066 1.0181 1.0036 1.0033 1.0115 1.0113 1.0096 1.0123 1.0152 1.0133 1.0179 1.0050 1.0014 0.9974 1.0233 1.0147 0.9934 1.0088 1.0092 0.9982 0.9953 1.0169 1.0073 1.0081 1.0221 1.0192 1.0000 1.0017 1.0021
dispcorr: -0.036306855 hartree
energy: -1510.083535256213
dipole: -17.99061 17.83983 -0.15077 14.55328 -14.43160 0.12168 17.57882 -16.55624 1.02258
magnitude: 1.04077 au
magnitude: 2.64543 debye
