program: Orca
programVersion: 5.0.2
elementType: Si F O O C C C C C C C C C C C C C C C C C C C C C C C C C H H H H H H H H H H H H H H H H H H H H H H H H H H H H H
charge: 0
multiplicity: 1
keywords: wb97x-d3
keywords: def2-TZVPP
keywords: def2/J RIJCOSX
keywords: DEFGRID2
keywords: scfconv7
keywords: smallprint printgap noloewdin
keywords: NOSOSCF
formula: C25H29FO2Si
InChI: InChI=1/C25H29FO2Si/c1-4-27-21-13-15-23(16-14-21)29(2,3)18-8-9-20-12-17-24(26)25(19-20)28-22-10-6-5-7-11-22/h5-7,10-17,19H,4,8-9,18H2,1-3H3
58 atoms
Si -3.602698 1.154146 1.240224
F  1.869075 -4.111355 -0.104503
O  1.659166 3.613238 -0.420087
O  1.794241 -1.764311 -1.523287
C  -3.588497 -0.576587 0.473994
C  -3.405061 -0.562085 -1.042159
C  -1.970894 1.9551 0.775215
C  -3.761394 0.995311 3.110946
C  -5.032489 2.179746 0.564828
C  -3.085826 -1.934349 -1.639878
C  -1.871411 3.226693 0.202597
C  -0.779989 1.252431 0.945735
C  -1.767459 -2.504582 -1.187827
C  -0.657127 3.765155 -0.181625
C  0.450069 1.768811 0.568254
C  0.518457 3.035176 -0.006576
C  -0.574601 -1.845705 -1.482563
C  -1.699114 -3.701027 -0.484848
C  0.648935 -2.381166 -1.120756
C  -0.479549 -4.247053 -0.105328
C  0.684947 -3.592807 -0.439216
C  2.858736 2.865221 -0.352207
C  3.967689 3.692909 -0.956392
C  2.687279 -1.281273 -0.617998
C  3.903541 -0.853235 -1.139178
C  2.432981 -1.168917 0.742244
C  4.860647 -0.314376 -0.297319
C  3.404597 -0.628044 1.573834
C  4.619008 -0.196813 1.065139
H  -2.770477 -1.137913 0.940507
H  -4.501964 -1.119544 0.73925
H  -2.611201 0.139177 -1.317173
H  -4.311943 -0.180536 -1.519474
H  -3.757701 1.97302 3.594807
H  -4.685627 0.489864 3.396438
H  -2.932426 0.424254 3.532068
H  -5.051734 3.180334 1.000156
H  -4.979279 2.295112 -0.51877
H  -5.991202 1.712937 0.796775
H  -3.886802 -2.634494 -1.388604
H  -3.082131 -1.855264 -2.731205
H  -2.765088 3.818464 0.040755
H  -0.793689 0.256538 1.376939
H  -0.605266 4.749912 -0.628226
H  1.337469 1.171629 0.719481
H  -0.581852 -0.905757 -2.021544
H  -2.611625 -4.227492 -0.235712
H  -0.430292 -5.184934 0.431734
H  2.754041 1.918992 -0.895509
H  3.097043 2.611645 0.687254
H  4.900362 3.130069 -0.920381
H  3.759856 3.934204 -1.998418
H  4.114391 4.624675 -0.410953
H  4.088562 -0.948667 -2.201022
H  1.486138 -1.48376 1.16138
H  5.805913 0.011608 -0.711185
H  3.199739 -0.542746 2.632878
H  5.370623 0.219812 1.721398
totalener: -1510.05110199 hartree
nucrepener: 2955.90100187 hartree
electener: -4465.95210385 hartree
oneelecener: -7940.94531748 hartree
twoeener: 3474.99321363 hartree
kineticenergy: 1503.95617541 hartree
xcener: -135.239249139621 hartree
chargesum: 0.0000000
charge: 0.427514 -0.193890 -0.287056 -0.293511 -0.255324 -0.113581 -0.112822 -0.375689 -0.424697 -0.122487 -0.053673 -0.167383 0.017443 -0.228241 -0.151528 0.294373 -0.213516 -0.116606 0.151265 -0.150845 0.225157 0.077010 -0.255622 0.343444 -0.248874 -0.213994 -0.081299 -0.083017 -0.197528 0.071592 0.078951 0.078912 0.083837 0.094685 0.090308 0.090363 0.096629 0.100341 0.099663 0.071316 0.100202 0.107199 0.094299 0.111315 0.061601 0.115553 0.109476 0.123477 0.070635 0.078044 0.075220 0.085019 0.087987 0.121760 0.126362 0.126020 0.128794 0.125415
qa: 0.4275 -0.1939 -0.2871 -0.2935 -0.2553 -0.1136 -0.1128 -0.3757 -0.4247 -0.1225 -0.0537 -0.1674 0.0174 -0.2282 -0.1515 0.2944 -0.2135 -0.1166 0.1513 -0.1508 0.2252 0.0770 -0.2556 0.3434 -0.2489 -0.2140 -0.0813 -0.0830 -0.1975 0.0716 0.0790 0.0789 0.0838 0.0947 0.0903 0.0904 0.0966 0.1003 0.0997 0.0713 0.1002 0.1072 0.0943 0.1113 0.0616 0.1156 0.1095 0.1235 0.0706 0.0780 0.0752 0.0850 0.0880 0.1218 0.1264 0.1260 0.1288 0.1254
va: 4.1866 1.1024 2.1408 2.1126 3.8321 3.8334 3.7889 3.8897 3.9133 3.8755 3.8835 3.9614 3.6747 4.0687 3.8386 3.8829 3.9753 3.9042 3.7787 3.9445 4.0111 3.8281 3.9692 3.6896 3.9975 3.9106 3.8604 3.8874 3.9517 1.0210 1.0201 1.0102 1.0092 1.0126 1.0121 1.0132 1.0117 1.0078 1.0125 1.0111 1.0026 0.9956 0.9987 1.0202 1.0560 1.0217 1.0109 1.0073 0.9937 0.9887 1.0073 1.0065 1.0066 1.0175 1.0131 0.9985 1.0008 1.0028
dispcorr: -0.033658811 hartree
energy: -1510.084760796093
dipole: -16.98512 16.76764 -0.21747 19.97742 -20.16151 -0.18409 5.28643 -5.18277 0.10366
magnitude: 0.30320 au
magnitude: 0.77067 debye
