program: Orca
programVersion: 5.0.2
elementType: Si F O O C C C C C C C C C C C C C C C C C C C C C C C C C H H H H H H H H H H H H H H H H H H H H H H H H H H H H H
charge: 0
multiplicity: 1
keywords: wb97x-d3
keywords: def2-TZVPP
keywords: def2/J RIJCOSX
keywords: DEFGRID2
keywords: scfconv7
keywords: smallprint printgap noloewdin
keywords: NOSOSCF
formula: C25H29FO2Si
InChI: InChI=1/C25H29FO2Si/c1-4-27-21-13-15-23(16-14-21)29(2,3)18-8-9-20-12-17-24(26)25(19-20)28-22-10-6-5-7-11-22/h5-7,10-17,19H,4,8-9,18H2,1-3H3
58 atoms
Si -2.639374 1.581105 -0.77199
F  1.808475 -4.456116 -0.639971
O  2.27412 2.6564 2.582179
O  2.072152 -1.769956 -0.558481
C  -2.946318 -0.278723 -1.005208
C  -3.469838 -1.08216 0.188111
C  -1.139433 1.961951 0.291558
C  -4.162753 2.358835 0.024744
C  -2.360813 2.315271 -2.486197
C  -2.449118 -1.345997 1.303369
C  0.149897 2.002754 -0.252066
C  -1.24576 2.18098 1.663141
C  -1.293122 -2.18751 0.840711
C  1.264911 2.231713 0.530907
C  -0.139012 2.405303 2.470574
C  1.133249 2.430286 1.904889
C  -0.115798 -1.591026 0.407882
C  -1.391409 -3.575371 0.781699
C  0.924261 -2.349658 -0.106179
C  -0.345613 -4.348238 0.302355
C  0.80286 -3.728767 -0.150891
C  2.277729 2.62024 3.994518
C  2.149918 1.213858 4.551105
C  1.982476 -0.904289 -1.606111
C  0.958329 -0.949954 -2.545179
C  2.992196 0.042684 -1.720141
C  0.945031 -0.029997 -3.583754
C  2.966424 0.952688 -2.763566
C  1.93946 0.929404 -3.697458
H  -3.680536 -0.3510 -1.815997
H  -2.038903 -0.742568 -1.406436
H  -3.842992 -2.04922 -0.16411
H  -4.335125 -0.574915 0.625412
H  -5.051777 2.194423 -0.586677
H  -4.376509 1.946974 1.012649
H  -4.039873 3.436359 0.141831
H  -1.506202 1.856882 -2.987582
H  -3.230643 2.163601 -3.127675
H  -2.170822 3.388004 -2.434616
H  -2.075259 -0.4018 1.703613
H  -2.960273 -1.849784 2.127862
H  0.303027 1.8395 -1.313314
H  -2.220467 2.175306 2.13868
H  2.250601 2.250957 0.085331
H  -0.290484 2.562764 3.529997
H  -0.001998 -0.514537 0.45801
H  -2.295873 -4.065327 1.121286
H  -0.419614 -5.426985 0.265678
H  1.507279 3.27962 4.409661
H  3.238997 3.046774 4.281969
H  2.949681 0.575422 4.177196
H  2.221264 1.239678 5.638914
H  1.199972 0.747762 4.29082
H  0.175952 -1.694376 -2.47744
H  3.786239 0.061553 -0.985165
H  0.146409 -0.072252 -4.313121
H  3.754398 1.690205 -2.842103
H  1.919874 1.644798 -4.508104
totalener: -1510.04619759 hartree
nucrepener: 3028.44112609 hartree
electener: -4538.48732367 hartree
oneelecener: -8086.21591787 hartree
twoeener: 3547.72859420 hartree
kineticenergy: 1503.95833747 hartree
xcener: -135.244572345571 hartree
chargesum: -0.0000000
charge: 0.401267 -0.192813 -0.291178 -0.297893 -0.231184 -0.141391 -0.154263 -0.407970 -0.397680 -0.126648 -0.047861 -0.087710 0.005762 -0.214381 -0.244590 0.322901 -0.134786 -0.130596 0.128601 -0.183678 0.228783 0.016264 -0.244939 0.288613 -0.129173 -0.260814 -0.193527 -0.078853 -0.122232 0.092246 0.059486 0.087166 0.077553 0.099981 0.081685 0.109149 0.082974 0.093103 0.102891 0.082519 0.089924 0.096282 0.121012 0.112766 0.106284 0.114791 0.113669 0.120260 0.071347 0.100508 0.092281 0.080869 0.088551 0.129741 0.130836 0.131532 0.127906 0.124656
qa: 0.4013 -0.1928 -0.2912 -0.2979 -0.2312 -0.1414 -0.1543 -0.4080 -0.3977 -0.1266 -0.0479 -0.0877 0.0058 -0.2144 -0.2446 0.3229 -0.1348 -0.1306 0.1286 -0.1837 0.2288 0.0163 -0.2449 0.2886 -0.1292 -0.2608 -0.1935 -0.0789 -0.1222 0.0922 0.0595 0.0872 0.0776 0.1000 0.0817 0.1091 0.0830 0.0931 0.1029 0.0825 0.0899 0.0963 0.1210 0.1128 0.1063 0.1148 0.1137 0.1203 0.0713 0.1005 0.0923 0.0809 0.0886 0.1297 0.1308 0.1315 0.1279 0.1247
va: 4.2091 1.1053 2.1205 2.1224 3.8056 3.9021 3.6858 3.9211 3.9042 3.8448 3.8345 3.8322 3.7134 4.0136 3.9437 3.8513 3.8284 3.9129 3.7410 3.9462 4.0773 3.9135 3.9096 3.7492 3.8340 3.9705 3.9331 3.8998 3.9056 1.0106 1.0344 1.0021 1.0042 1.0102 1.0119 1.0106 1.0199 1.0140 1.0122 1.0257 1.0104 0.9796 0.9914 1.0250 1.0144 1.0109 1.0070 1.0080 0.9940 0.9943 1.0064 1.0118 1.0065 1.0070 1.0128 1.0007 0.9974 1.0006
dispcorr: -0.036176581 hartree
energy: -1510.082374167783
dipole: -21.34647 20.55859 -0.78788 20.77723 -20.32916 0.44807 7.42567 -6.75702 0.66865
magnitude: 1.12633 au
magnitude: 2.86291 debye
