program: Orca
programVersion: 5.0.2
elementType: Si F O O C C C C C C C C C C C C C C C C C C C C C C C C C H H H H H H H H H H H H H H H H H H H H H H H H H H H H H
charge: 0
multiplicity: 1
keywords: wb97x-d3
keywords: def2-TZVPP
keywords: def2/J RIJCOSX
keywords: DEFGRID2
keywords: scfconv7
keywords: smallprint printgap noloewdin
keywords: NOSOSCF
formula: C25H29FO2Si
InChI: InChI=1/C25H29FO2Si/c1-4-27-21-13-15-23(16-14-21)29(2,3)18-8-9-20-12-17-24(26)25(19-20)28-22-10-6-5-7-11-22/h5-7,10-17,19H,4,8-9,18H2,1-3H3
58 atoms
Si -3.817965 1.622182 0.877611
F  1.983061 -4.002684 -1.485277
O  1.849197 2.595466 -0.99263
O  1.885465 -1.302477 -1.422537
C  -3.917425 -0.095444 1.70155
C  -2.825621 -1.08273 1.290684
C  -2.056713 1.952004 0.314114
C  -4.331568 2.920986 2.144317
C  -4.978248 1.717847 -0.605854
C  -2.8462 -1.451621 -0.194826
C  -0.998705 1.93508 1.221723
C  -1.727545 2.194729 -1.022685
C  -1.584874 -2.158933 -0.599534
C  0.318639 2.141898 0.837952
C  -0.424074 2.409465 -1.430142
C  0.617998 2.387654 -0.501852
C  -0.436096 -1.410396 -0.847429
C  -1.503322 -3.543539 -0.6690
C  0.763459 -2.028128 -1.146362
C  -0.305741 -4.176726 -0.973714
C  0.819929 -3.414546 -1.201761
C  2.952726 2.725529 -0.114608
C  3.01016 4.085827 0.554793
C  2.730596 -0.9861 -0.403392
C  4.021166 -0.618341 -0.767714
C  2.357886 -0.992733 0.935056
C  4.935453 -0.261316 0.207719
C  3.28675 -0.629372 1.901344
C  4.575624 -0.262233 1.549344
H  -3.880036 0.043774 2.786623
H  -4.906844 -0.521946 1.501827
H  -2.902059 -2.001871 1.87971
H  -1.846582 -0.659064 1.528134
H  -3.644487 2.948752 2.991814
H  -4.343979 3.919182 1.704834
H  -5.328804 2.722613 2.541454
H  -6.008231 1.529371 -0.297845
H  -4.958288 2.705011 -1.070756
H  -4.7371 0.985262 -1.377742
H  -3.721588 -2.069983 -0.41092
H  -2.951762 -0.548544 -0.801428
H  -1.192092 1.751963 2.27395
H  -2.505929 2.215824 -1.776826
H  1.094419 2.104509 1.590225
H  -0.193803 2.593568 -2.471677
H  -0.470693 -0.327297 -0.807831
H  -2.386152 -4.143452 -0.486029
H  -0.242537 -5.255127 -1.032169
H  3.829915 2.58107 -0.74436
H  2.967389 1.917553 0.622379
H  3.045889 4.88445 -0.185724
H  2.153216 4.267791 1.203385
H  3.910091 4.154893 1.166872
H  4.297551 -0.623288 -1.813774
H  1.356102 -1.272529 1.231933
H  5.940579 0.014276 -0.083851
H  2.990664 -0.638631 2.942387
H  5.293592 0.013433 2.309694
totalener: -1510.04663371 hartree
nucrepener: 3006.91287162 hartree
electener: -4516.95950533 hartree
oneelecener: -8043.15162550 hartree
twoeener: 3526.19212017 hartree
kineticenergy: 1503.96385251 hartree
xcener: -135.244013884360 hartree
chargesum: 0.0000000
charge: 0.433851 -0.195363 -0.291215 -0.296388 -0.287552 -0.096160 -0.078982 -0.408277 -0.401567 -0.109917 -0.201173 -0.087587 0.023944 -0.184863 -0.213284 0.306368 -0.142723 -0.118025 0.116605 -0.181597 0.264284 0.069564 -0.255528 0.259110 -0.160700 -0.133695 -0.148215 -0.177475 -0.110336 0.095175 0.079667 0.089593 0.066347 0.088587 0.094790 0.092513 0.099184 0.100338 0.094626 0.086685 0.070916 0.110553 0.115439 0.110275 0.111144 0.055284 0.110719 0.119886 0.103148 0.031440 0.092386 0.086006 0.083417 0.120390 0.129369 0.123134 0.122741 0.123142
qa: 0.4339 -0.1954 -0.2912 -0.2964 -0.2876 -0.0962 -0.0790 -0.4083 -0.4016 -0.1099 -0.2012 -0.0876 0.0239 -0.1849 -0.2133 0.3064 -0.1427 -0.1180 0.1166 -0.1816 0.2643 0.0696 -0.2555 0.2591 -0.1607 -0.1337 -0.1482 -0.1775 -0.1103 0.0952 0.0797 0.0896 0.0663 0.0886 0.0948 0.0925 0.0992 0.1003 0.0946 0.0867 0.0709 0.1106 0.1154 0.1103 0.1111 0.0553 0.1107 0.1199 0.1031 0.0314 0.0924 0.0860 0.0834 0.1204 0.1294 0.1231 0.1227 0.1231
va: 4.1298 1.1041 2.0981 2.1080 3.8639 3.8396 3.7240 3.9030 3.8988 3.7964 3.9713 3.8441 3.7086 3.8414 4.0423 3.7758 3.8455 3.9121 3.8039 3.9569 4.0590 3.8887 3.9585 3.7500 3.9400 3.8113 3.9464 3.9484 3.8682 1.0087 1.0143 1.0109 1.0166 1.0157 1.0149 1.0122 1.0160 1.0098 1.0128 1.0137 1.0306 0.9971 0.9968 1.0087 1.0213 1.0454 1.0096 1.0082 0.9939 1.0025 1.0073 1.0040 1.0099 1.0178 1.0072 1.0009 1.0033 1.0007
dispcorr: -0.035857186 hartree
energy: -1510.082490898568
dipole: -19.72175 19.42890 -0.29285 23.55914 -23.23364 0.32549 15.34660 -14.51756 0.82905
magnitude: 0.93756 au
magnitude: 2.38310 debye
