program: Orca
programVersion: 5.0.2
elementType: Si F O O C C C C C C C C C C C C C C C C C C C C C C C C C H H H H H H H H H H H H H H H H H H H H H H H H H H H H H
charge: 0
multiplicity: 1
keywords: wb97x-d3
keywords: def2-TZVPP
keywords: def2/J RIJCOSX
keywords: DEFGRID2
keywords: scfconv7
keywords: smallprint printgap noloewdin
keywords: NOSOSCF
formula: C25H29FO2Si
InChI: InChI=1/C25H29FO2Si/c1-4-27-21-13-15-23(16-14-21)29(2,3)18-8-9-20-12-17-24(26)25(19-20)28-22-10-6-5-7-11-22/h5-7,10-17,19H,4,8-9,18H2,1-3H3
58 atoms
Si -3.660395 1.022767 1.132592
F  1.915867 -3.725361 -0.770113
O  1.791682 2.957087 -0.6067
O  1.787638 -1.060608 -1.402999
C  -3.767092 -0.872021 1.080111
C  -4.130468 -1.479724 -0.274282
C  -1.971022 1.619524 0.576479
C  -3.92677 1.579215 2.915743
C  -4.995707 1.775977 0.034365
C  -3.095776 -1.248046 -1.374536
C  -0.847014 1.345781 1.35252
C  -1.759166 2.348225 -0.597141
C  -1.75704 -1.898057 -1.139451
C  0.424989 1.772243 1.000878
C  -0.500211 2.775208 -0.97713
C  0.608369 2.494613 -0.176305
C  -0.579997 -1.16665 -1.265127
C  -1.661943 -3.256905 -0.852354
C  0.657876 -1.778668 -1.151401
C  -0.430284 -3.877332 -0.7109
C  0.721169 -3.137426 -0.874871
C  2.930239 2.798763 0.219601
C  4.122716 3.372457 -0.506319
C  2.733198 -0.909211 -0.437872
C  4.001062 -0.543492 -0.874409
C  2.475089 -1.058918 0.918579
C  5.009454 -0.327073 0.049347
C  3.497232 -0.840067 1.831954
C  4.765357 -0.472871 1.408432
H  -2.820161 -1.292814 1.435663
H  -4.516801 -1.178967 1.817321
H  -5.086018 -1.071967 -0.616426
H  -4.301841 -2.554623 -0.161261
H  -4.9099 1.283312 3.286361
H  -3.184786 1.148431 3.590498
H  -3.851486 2.663755 3.004091
H  -5.987839 1.440941 0.341844
H  -4.988979 2.865425 0.095589
H  -4.879477 1.507525 -1.01738
H  -3.502067 -1.626672 -2.317461
H  -2.947891 -0.176408 -1.527264
H  -0.950887 0.784045 2.275117
H  -2.596921 2.598185 -1.23867
H  1.257129 1.533573 1.647998
H  -0.359118 3.340607 -1.88946
H  -0.611781 -0.104033 -1.475802
H  -2.559454 -3.85379 -0.75102
H  -0.357952 -4.93571 -0.497737
H  3.105184 1.742497 0.441545
H  2.776242 3.316919 1.174051
H  4.304286 2.842982 -1.440919
H  3.987902 4.430767 -0.727854
H  5.011552 3.266886 0.115356
H  4.18475 -0.432982 -1.935042
H  1.486856 -1.330568 1.266485
H  5.994791 -0.045633 -0.298152
H  3.29318 -0.958458 2.888307
H  5.555905 -0.308002 2.127849
totalener: -1510.05001256 hartree
nucrepener: 3023.23937249 hartree
electener: -4533.28938505 hartree
oneelecener: -8075.87325739 hartree
twoeener: 3542.58387234 hartree
kineticenergy: 1503.96380953 hartree
xcener: -135.244938463686 hartree
chargesum: 0.0000000
charge: 0.426927 -0.196839 -0.284256 -0.292712 -0.236510 -0.162235 -0.083790 -0.415173 -0.413956 -0.093204 -0.109636 -0.099293 -0.001710 -0.252596 -0.246814 0.339231 -0.162862 -0.128114 0.101666 -0.177898 0.270621 0.091973 -0.270504 0.326222 -0.241741 -0.178200 -0.097631 -0.128364 -0.141656 0.077422 0.089717 0.084947 0.085799 0.091383 0.087965 0.096892 0.103486 0.109766 0.088868 0.099056 0.065433 0.094663 0.115387 0.105977 0.110442 0.130619 0.108499 0.120544 0.013612 0.101653 0.085670 0.094846 0.079347 0.120109 0.124956 0.122457 0.125493 0.124042
qa: 0.4269 -0.1968 -0.2843 -0.2927 -0.2365 -0.1622 -0.0838 -0.4152 -0.4140 -0.0932 -0.1096 -0.0993 -0.0017 -0.2526 -0.2468 0.3392 -0.1629 -0.1281 0.1017 -0.1779 0.2706 0.0920 -0.2705 0.3262 -0.2417 -0.1782 -0.0976 -0.1284 -0.1417 0.0774 0.0897 0.0849 0.0858 0.0914 0.0880 0.0969 0.1035 0.1098 0.0889 0.0991 0.0654 0.0947 0.1154 0.1060 0.1104 0.1306 0.1085 0.1205 0.0136 0.1017 0.0857 0.0948 0.0793 0.1201 0.1250 0.1225 0.1255 0.1240
va: 4.1465 1.0975 2.1217 2.0959 3.8209 3.9123 3.6886 3.9072 3.9107 3.8100 3.9455 3.8339 3.7142 3.9214 4.0451 3.8133 3.9047 3.9111 3.8519 3.9743 3.9891 3.8216 3.9729 3.6375 3.9794 3.8661 3.8861 3.9315 3.9164 1.0204 1.0072 1.0021 1.0037 1.0136 1.0153 1.0131 1.0119 1.0116 1.0104 1.0029 1.0223 1.0052 0.9955 1.0192 1.0211 1.0044 1.0122 1.0090 0.9830 0.9965 1.0075 1.0092 1.0075 1.0192 1.0155 1.0012 1.0008 1.0007
dispcorr: -0.036310396 hartree
energy: -1510.086322954704
dipole: -18.12021 17.87423 -0.24598 17.94307 -17.89605 0.04701 9.84229 -9.32273 0.51956
magnitude: 0.57677 au
magnitude: 1.46603 debye
