program: Orca
programVersion: 5.0.2
elementType: Si F O O C C C C C C C C C C C C C C C C C C C C C C C C C H H H H H H H H H H H H H H H H H H H H H H H H H H H H H
charge: 0
multiplicity: 1
keywords: wb97x-d3
keywords: def2-TZVPP
keywords: def2/J RIJCOSX
keywords: DEFGRID2
keywords: scfconv7
keywords: smallprint printgap noloewdin
keywords: NOSOSCF
formula: C25H29FO2Si
InChI: InChI=1/C25H29FO2Si/c1-4-27-21-13-15-23(16-14-21)29(2,3)18-8-9-20-12-17-24(26)25(19-20)28-22-10-6-5-7-11-22/h5-7,10-17,19H,4,8-9,18H2,1-3H3
58 atoms
Si -4.03764 1.558194 0.426455
F  2.099272 -4.210283 -0.382762
O  1.897473 2.418913 1.167094
O  2.040385 -1.693984 0.639032
C  -4.309674 0.180725 -0.863789
C  -3.149913 -0.800384 -1.03236
C  -2.195697 1.851185 0.647511
C  -4.798393 1.083981 2.085745
C  -4.86715 3.130171 -0.201293
C  -2.830533 -1.602186 0.23102
C  -1.38102 2.152155 -0.442573
C  -1.562791 1.742263 1.88987
C  -1.52602 -2.333368 0.103829
C  -0.010355 2.334851 -0.322926
C  -0.20188 1.929837 2.038519
C  0.591076 2.234797 0.930734
C  -0.337664 -1.682156 0.428138
C  -1.460911 -3.628083 -0.394939
C  0.882113 -2.313549 0.269871
C  -0.242903 -4.271422 -0.562499
C  0.918701 -3.608893 -0.22926
C  2.755443 2.755569 0.093148
C  4.12871 3.021953 0.661008
C  2.812293 -1.11543 -0.319802
C  2.379345 -0.879553 -1.618512
C  4.091962 -0.736021 0.071045
C  3.242614 -0.275014 -2.522952
C  4.938185 -0.132846 -0.842194
C  4.521458 0.101718 -2.146206
H  -5.226494 -0.361677 -0.606808
H  -4.517856 0.653263 -1.82909
H  -2.251116 -0.256373 -1.332119
H  -3.359458 -1.499864 -1.847691
H  -4.68868 1.880734 2.8234
H  -5.867929 0.896237 1.97493
H  -4.357636 0.180025 2.508966
H  -4.778267 3.941579 0.522054
H  -4.415349 3.475818 -1.132665
H  -5.930262 2.974463 -0.394064
H  -2.77325 -0.9310 1.091337
H  -3.644167 -2.301964 0.441236
H  -1.815638 2.246353 -1.432661
H  -2.142914 1.502864 2.773642
H  0.570899 2.551825 -1.208429
H  0.265615 1.84494 3.01108
H  -0.35608 -0.66907 0.815188
H  -2.373705 -4.15026 -0.653613
H  -0.190612 -5.282226 -0.944134
H  2.384117 3.648109 -0.425155
H  2.794134 1.938246 -0.635176
H  4.115338 3.862577 1.354218
H  4.512577 2.146793 1.182974
H  4.819655 3.259155 -0.147575
H  1.382858 -1.160137 -1.932594
H  4.413964 -0.925369 1.086506
H  2.902769 -0.100234 -3.535431
H  5.934441 0.153772 -0.531552
H  5.188189 0.566908 -2.859221
totalener: -1510.05012798 hartree
nucrepener: 2984.59989967 hartree
electener: -4494.65002764 hartree
oneelecener: -7998.49518442 hartree
twoeener: 3503.84515678 hartree
kineticenergy: 1503.96615890 hartree
xcener: -135.241688488705 hartree
chargesum: -0.0000000
charge: 0.436282 -0.195368 -0.280610 -0.291519 -0.285417 -0.116135 -0.090773 -0.402898 -0.405478 -0.098439 -0.191755 -0.088298 0.014662 -0.182910 -0.206320 0.299823 -0.114018 -0.120935 0.079258 -0.184865 0.272321 0.040072 -0.272986 0.293931 -0.158899 -0.207678 -0.135350 -0.121854 -0.142374 0.079871 0.095441 0.076382 0.089278 0.099713 0.099262 0.095915 0.094763 0.088712 0.091403 0.064334 0.090027 0.112017 0.116326 0.103348 0.110953 0.068875 0.113179 0.120403 0.101334 0.065174 0.097468 0.084993 0.082090 0.122456 0.121778 0.123357 0.126241 0.123437
qa: 0.4363 -0.1954 -0.2806 -0.2915 -0.2854 -0.1161 -0.0908 -0.4029 -0.4055 -0.0984 -0.1918 -0.0883 0.0147 -0.1829 -0.2063 0.2998 -0.1140 -0.1209 0.0793 -0.1849 0.2723 0.0401 -0.2730 0.2939 -0.1589 -0.2077 -0.1354 -0.1219 -0.1424 0.0799 0.0954 0.0764 0.0893 0.0997 0.0993 0.0959 0.0948 0.0887 0.0914 0.0643 0.0900 0.1120 0.1163 0.1033 0.1110 0.0689 0.1132 0.1204 0.1013 0.0652 0.0975 0.0850 0.0821 0.1225 0.1218 0.1234 0.1262 0.1234
va: 4.1357 1.1017 2.1059 2.1134 3.8563 3.8422 3.7387 3.8984 3.9015 3.7884 3.9902 3.8351 3.7126 3.8773 4.0217 3.8226 3.8702 3.9152 3.8581 3.9654 4.0301 3.8115 3.9775 3.7069 3.8586 3.9673 3.9413 3.8918 3.9072 1.0145 1.0089 1.0166 1.0120 1.0100 1.0160 1.0119 1.0148 1.0154 1.0125 1.0319 1.0119 0.9958 0.9969 1.0214 1.0210 1.0480 1.0083 1.0087 0.9952 0.9807 1.0097 1.0078 1.0065 1.0147 1.0181 1.0010 0.9988 1.0015
dispcorr: -0.034924397 hartree
energy: -1510.085052373946
dipole: -19.77160 19.34817 -0.42343 23.61152 -23.17108 0.44045 -1.84744 1.20937 -0.63807
magnitude: 0.88341 au
magnitude: 2.24546 debye
