program: Orca
programVersion: 5.0.2
elementType: Si F O O C C C C C C C C C C C C C C C C C C C C C C C C C H H H H H H H H H H H H H H H H H H H H H H H H H H H H H
charge: 0
multiplicity: 1
keywords: wb97x-d3
keywords: def2-TZVPP
keywords: def2/J RIJCOSX
keywords: DEFGRID2
keywords: scfconv7
keywords: smallprint printgap noloewdin
keywords: NOSOSCF
formula: C25H29FO2Si
InChI: InChI=1/C25H29FO2Si/c1-4-27-21-13-15-23(16-14-21)29(2,3)18-8-9-20-12-17-24(26)25(19-20)28-22-10-6-5-7-11-22/h5-7,10-17,19H,4,8-9,18H2,1-3H3
58 atoms
Si -3.582301 1.126627 1.253417
F  1.919457 -4.057835 0.010438
O  1.63223 3.859392 -0.125091
O  1.91714 -1.786058 -1.530818
C  -3.520748 -0.575917 0.429791
C  -3.296404 -0.509987 -1.079862
C  -1.95732 1.982009 0.864959
C  -3.803526 0.909081 3.112334
C  -5.012444 2.141397 0.561186
C  -2.963767 -1.862682 -1.715657
C  -1.856421 3.356436 0.630874
C  -0.778595 1.245963 0.761031
C  -1.664373 -2.448129 -1.232165
C  -0.655652 3.959559 0.3059
C  0.436594 1.82556 0.430569
C  0.506603 3.195932 0.195469
C  -0.453622 -1.829419 -1.541054
C  -1.631954 -3.606793 -0.466195
C  0.753102 -2.365153 -1.126331
C  -0.430009 -4.152925 -0.034558
C  0.752806 -3.537962 -0.378484
C  2.810804 3.134281 -0.427026
C  2.771428 2.480288 -1.795398
C  2.798867 -1.290022 -0.618938
C  4.057167 -0.959312 -1.108389
C  2.489323 -1.071316 0.716533
C  5.001091 -0.40983 -0.25883
C  3.448108 -0.521733 1.556941
C  4.704509 -0.186677 1.079485
H  -2.718526 -1.153484 0.90327
H  -4.440721 -1.128435 0.648906
H  -2.493887 0.19669 -1.311459
H  -4.189949 -0.109567 -1.566845
H  -4.738213 0.39934 3.352676
H  -2.989262 0.32295 3.541005
H  -3.812283 1.871574 3.625813
H  -5.080924 3.123697 1.031589
H  -4.912037 2.301187 -0.51314
H  -5.966853 1.640473 0.732045
H  -3.775107 -2.567137 -1.514972
H  -2.922045 -1.745298 -2.802467
H  -2.739411 3.982366 0.69278
H  -0.790906 0.173236 0.924322
H  -0.604326 5.025583 0.124586
H  1.311069 1.194439 0.360348
H  -0.435124 -0.920141 -2.130711
H  -2.558907 -4.101628 -0.20597
H  -0.408024 -5.060988 0.553271
H  3.034822 2.396175 0.3506
H  3.608989 3.876345 -0.394332
H  3.728119 1.997525 -1.994589
H  2.000938 1.713338 -1.868297
H  2.591349 3.219818 -2.575349
H  4.284708 -1.136546 -2.151395
H  1.51065 -1.313119 1.110625
H  5.9795 -0.15871 -0.64687
H  3.198997 -0.352608 2.596128
H  5.445871 0.239002 1.741433
totalener: -1510.04882299 hartree
nucrepener: 2971.38260022 hartree
electener: -4481.43142321 hartree
oneelecener: -7971.84152361 hartree
twoeener: 3490.41010040 hartree
kineticenergy: 1503.95839591 hartree
xcener: -135.241609423193 hartree
chargesum: 0.0000000
charge: 0.430738 -0.193359 -0.294675 -0.295599 -0.258672 -0.127815 -0.102914 -0.376805 -0.420004 -0.122265 -0.075563 -0.154885 0.046233 -0.212696 -0.118910 0.276740 -0.252992 -0.131484 0.163900 -0.142507 0.223563 0.067406 -0.272884 0.346179 -0.275038 -0.178434 -0.062480 -0.118734 -0.187923 0.073986 0.080235 0.083121 0.086094 0.089381 0.091954 0.093496 0.093196 0.103568 0.098687 0.072589 0.099704 0.100672 0.096589 0.111314 0.025698 0.119531 0.110819 0.123807 0.064691 0.095174 0.082817 0.085710 0.102327 0.123182 0.131010 0.127863 0.129183 0.125478
qa: 0.4307 -0.1934 -0.2947 -0.2956 -0.2587 -0.1278 -0.1029 -0.3768 -0.4200 -0.1223 -0.0756 -0.1549 0.0462 -0.2127 -0.1189 0.2767 -0.2530 -0.1315 0.1639 -0.1425 0.2236 0.0674 -0.2729 0.3462 -0.2750 -0.1784 -0.0625 -0.1187 -0.1879 0.0740 0.0802 0.0831 0.0861 0.0894 0.0920 0.0935 0.0932 0.1036 0.0987 0.0726 0.0997 0.1007 0.0966 0.1113 0.0257 0.1195 0.1108 0.1238 0.0647 0.0952 0.0828 0.0857 0.1023 0.1232 0.1310 0.1279 0.1292 0.1255
va: 4.1876 1.1029 2.1286 2.1062 3.8393 3.8419 3.7867 3.8826 3.9023 3.8713 3.9220 3.9227 3.6329 4.0636 3.7868 3.8954 3.9680 3.9041 3.7752 3.9450 4.0245 3.8713 3.9123 3.6292 4.0101 3.8856 3.8618 3.9243 3.9612 1.0182 1.0186 1.0068 1.0106 1.0120 1.0129 1.0136 1.0140 1.0071 1.0114 1.0115 1.0042 0.9970 0.9928 1.0200 1.0758 1.0164 1.0108 1.0068 1.0058 0.9941 1.0141 1.0031 1.0105 1.0175 1.0103 0.9971 1.0015 1.0025
dispcorr: -0.034710359 hartree
energy: -1510.083533349377
dipole: -19.47393 19.25810 -0.21583 17.52510 -17.74444 -0.21934 2.48235 -2.54978 -0.06743
magnitude: 0.31503 au
magnitude: 0.80073 debye
